program: Gaussian 09
title: 000206384
version: EM64L-G09RevD.01
frameworkgroup: C1[X(C26H16ClN3O3)]
method: RPBEPBE
basis: SDD
operation: Freq
keyword: #p
keyword: freq=noraman
keyword: PBEPBE/SDD
title: #p freq=noraman PBEPBE/SDD
converged: YES YES NO NO
title: Mulliken charges:
elementType: Cl O O O N N N C C C C C C C C C C C C C C C C C C C C C C C C C C H H H H H H H H H H H H H H H H
charge: -0.041119 -0.292794 -0.219408 -0.217778 -0.068281 -0.019673 0.020348 0.215448 0.054404 0.032463 -0.201867 0.325759 0.346536 -0.304345 -0.327794 -0.494517 -0.390115 0.331946 -0.161236 -0.368882 -0.401699 -0.201283 -0.192779 -0.385828 -0.231537 -0.236912 -0.231079 0.347364 -0.307317 -0.351585 0.380147 -0.354602 -0.332932 0.297749 0.271118 0.312515 0.280144 0.258002 0.266580 0.264681 0.234939 0.263232 0.237948 0.234914 0.237035 0.276942 0.268857 0.286951 0.289338
chargesum: 0.00000
title: Mulliken charges with hydrogens summed into heavy atoms:
elementType: Cl O O O N N N C C C C C C C C C C C C C C C C C C C C C C C C C C
charge: -0.041119 -0.292794 -0.219408 -0.217778 -0.068281 -0.019673 0.020348 0.215448 0.054404 0.032463 -0.201867 0.325759 0.346536 -0.006596 -0.056676 -0.182003 -0.109970 0.331946 -0.161236 -0.110880 -0.135120 0.063398 0.042161 -0.122596 0.006412 -0.001998 0.005956 0.347364 -0.030375 -0.082728 0.380147 -0.067650 -0.043594
polarizability: 5.02665421e+02 2.92149327e+01 4.27878119e+02 3.31023631e+01 8.48778938e-01 1.86451630e+02
1716.lowfreq: -3.3751 -0.0012 -0.0011 -0.0005 3.3975 4.1590 9.1246 14.3923 28.9436
frequency: 8.9127 14.3813 28.8676 41.5938 46.8219 50.7190 62.1337 68.3294 79.2644 81.8798 103.9194 122.5443 172.5370 181.5013 191.1678 204.3085 217.4097 235.8643 245.0622 265.5156 282.4431 285.6400 306.5124 345.9105 357.0329 387.2466 405.9173 406.9451 417.7474 426.3454 436.9057 448.3464 474.9304 485.0458 504.2483 518.0708 524.3322 553.4571 589.6323 599.3543 614.7030 618.1084 621.2586 635.1696 638.8226 664.2539 671.6789 674.9765 690.9410 704.3232 724.2959 730.4005 739.4444 763.1304 778.2606 802.3889 808.8688 822.5652 827.7735 832.0213 843.6925 847.3877 856.2687 857.3698 903.1196 919.5616 929.8678 938.1660 945.3473 962.0382 976.1087 982.4359 984.8864 988.0540 989.3832 989.8043 995.8733 999.5960 1002.9710 1026.9469 1058.9131 1068.0137 1083.1661 1089.2810 1095.5782 1109.3511 1123.1298 1138.9296 1164.9169 1168.4165 1174.9249 1176.1848 1191.8011 1221.8467 1226.9632 1241.8424 1259.0724 1272.7857 1288.7314 1292.4865 1308.3443 1323.9860 1353.3841 1361.7465 1379.1499 1388.6955 1391.0369 1404.5962 1412.8335 1427.7173 1433.4592 1434.6297 1465.9768 1472.1998 1480.1873 1491.5155 1494.0295 1540.0719 1583.2677 1586.9570 1589.9999 1602.2975 1609.4434 1611.9397 1612.4261 3130.9250 3138.9275 3145.8884 3150.2675 3160.3148 3161.9389 3166.3369 3169.2270 3170.2119 3170.4026 3171.8366 3178.8352 3180.0384 3182.2283 3186.4512 3190.8184
redmass: 8.1605 10.3129 6.5796 7.0668 5.5471 5.6044 5.5863 5.5119 5.8954 6.3221 8.5715 6.6296 8.3769 6.8314 7.0154 6.5648 7.1000 6.3518 5.8263 6.7693 6.3998 6.6520 6.2371 7.6739 6.2069 7.4854 3.4731 4.7669 3.1253 5.4420 3.8081 3.7087 4.0297 3.4307 6.5979 6.3247 5.7332 4.1770 6.4550 6.6092 6.5203 7.5651 7.3897 8.4700 6.8314 4.8098 7.0008 5.4621 2.9111 1.7669 4.7109 3.4384 5.6459 4.7311 2.5569 2.9355 3.6501 1.8378 5.1710 1.2942 2.5184 4.2926 1.6075 1.3387 1.4967 4.9807 1.3902 1.4205 1.5195 4.8357 1.3379 1.3276 1.4716 5.1549 2.3710 1.9727 2.9064 1.3504 1.3275 2.2544 2.2640 2.2787 1.5727 1.6265 3.2325 1.2484 1.7100 2.2993 1.4459 1.1814 2.3575 1.0619 1.1251 4.6942 3.8017 1.8532 4.3953 1.7190 1.4844 2.5331 2.0689 1.5051 8.1012 3.5351 7.4941 4.7393 9.7188 8.8556 6.0670 3.4797 2.7968 3.3164 3.1086 2.4958 2.8801 3.2744 7.2029 8.6019 6.0515 7.0198 7.6847 7.0107 6.2373 6.8456 6.8516 1.0852 1.0882 1.0878 1.0928 1.0962 1.0884 1.0910 1.0897 1.0910 1.0911 1.1011 1.0929 1.0984 1.0977 1.0963 1.0973
irintensity: 0.5252 0.5322 0.1190 0.1434 0.0333 0.3817 0.2711 0.7916 0.4422 0.7052 1.9495 1.5767 3.0303 0.3088 0.9662 0.1014 1.2149 0.1799 0.7706 0.3977 0.4203 2.4164 1.0122 7.2581 2.1530 3.2269 2.7310 2.7194 1.0251 1.8751 2.8220 4.5708 2.9869 8.5200 7.3232 10.8384 9.7390 7.6981 3.9731 3.8981 0.7751 11.4418 7.5752 5.8371 8.5554 27.0321 12.0724 2.8432 10.7959 57.5366 5.8845 15.3908 1.9646 20.2870 35.8657 21.7251 10.5728 40.6564 7.5815 4.4714 56.1485 42.4685 79.0553 14.4158 6.5778 52.1553 1.3616 0.4485 17.1818 35.8686 0.6555 2.1596 3.2969 5.2550 1.3362 0.4064 1.9575 1.8683 0.0588 4.5362 12.2626 39.9622 15.0100 11.6428 16.7575 21.4426 4.0774 30.3550 215.7802 4.5902 119.2146 2.2240 4.3845 790.8989 28.9455 84.7944 5.9052 23.8580 4.9933 14.1763 51.1197 22.6242 102.3737 34.9124 3.3075 102.7967 40.2225 39.4971 67.3023 65.7937 15.1938 19.5482 114.3576 94.5921 8.6160 9.1317 361.6943 44.2122 6.1350 148.5085 47.4922 29.1526 6.2634 114.3672 4.7328 1.1324 2.5455 12.9556 15.1565 20.7054 0.2081 9.0019 1.1425 0.3158 1.0526 17.0249 1.1372 13.5617 6.3706 1.0215 3.9352
temp: 298.150 k
press: 1.00000 atm
elementType: 17 8 8 8 7 7 7 6 6 6 6 6 6 6 6 6 6 6 6 6 6 6 6 6 6 6 6 6 6 6 6 6 6 1 1 1 1 1 1 1 1 1 1 1 1 1 1 1 1
symmnumber: 1
zpe: 929151.1 jmol-1
zpe.correction: 0.353895 hartree
zpe.thermalcorrener: 0.380196 hartree
zpe.thermalcorrenthalpy: 0.381140 hartree
zpe.thermalcorrgfe: 0.293377 hartree
zpe.sumelectzpe: -1848.051745 hartree
zpe.sumelectthermal: -1848.025444 hartree
zpe.sumelectthermalent: -1848.024499 hartree
zpe.sumelectthermalfe: -1848.112263 hartree
dipole: 4.5742 3.2351 -1.5701
dipole: 5.8185
quadrupole: -219.5237 -185.2658 -199.8182
quadrupole: -22.0563 9.3934 14.3485
quadrupole: -17.9878 16.2701 1.7177 -22.0563 9.3934 14.3485
hfenergy: -1848.4056398 hartree
pointgroup: C01 [X(C26H16Cl1N3O3)]
dipole: -1.825498 1.1948673 0.692917 debye
polarizability: 504.5539438|-28.8459016|425.8619921|29.2161186|12.2505955|186.5792334 unknown
InChI: InChI=1S/C26H16ClN3O3/c27-19-9-14-24-23(16-19)25(17-5-2-1-3-6-17)29-26(28-24)18-7-4-8-22(15-18)33-21-12-10-20(11-13-21)30(31)32/h1-16H
charge 0 multiplicity 1
49 atoms
Cl -7.380391 -1.406656 -1.155398
O  3.400989 2.325592 0.935801
O  5.467113 -2.623632 -2.550238
O  6.901142 -2.702319 -0.774993
N  -1.239294 0.267695 0.277742
N  -2.685075 2.193419 -0.066541
N  5.907462 -2.178104 -1.417158
C  -3.603169 -0.10916 -0.166516
C  -2.275211 -0.59575 0.171269
C  -3.754873 1.331446 -0.235859
C  -1.471516 1.628976 0.133751
C  -1.961634 -2.029774 0.424738
C  -0.285254 2.520821 0.233541
C  -4.724367 -0.943671 -0.469972
C  -5.041904 1.890893 -0.516741
C  0.990707 1.96483 0.506439
C  -0.419678 3.924506 0.05893
C  2.107934 2.817539 0.578753
C  -5.950851 -0.350354 -0.760006
C  -0.723575 -2.555772 -0.034635
C  -2.832429 -2.872019 1.169866
C  -6.135966 1.062896 -0.771834
C  0.711972 4.759343 0.157628
C  1.990506 4.21277 0.415492
C  -0.378661 -3.899427 0.214459
C  -2.478179 -4.213065 1.43114
C  -1.256527 -4.73443 0.946332
C  3.947706 1.197752 0.309226
C  3.513667 0.706171 -0.949975
C  5.034699 0.593784 0.991348
C  5.236741 -1.007212 -0.823492
C  4.163832 -0.402718 -1.517512
C  5.683791 -0.513868 0.425508
H  -4.613623 -2.02974 -0.501448
H  -5.131907 2.98035 -0.544877
H  1.07161 0.886505 0.670085
H  -1.41346 4.331918 -0.145437
H  -0.044536 -1.896465 -0.584349
H  -3.761211 -2.469677 1.588204
H  -7.120854 1.481623 -0.997205
H  0.605642 5.841483 0.029182
H  2.881746 4.841769 0.496498
H  0.572786 -4.295236 -0.156666
H  -3.150398 -4.846422 2.019981
H  -0.986192 -5.777353 1.144602
H  2.690393 1.190646 -1.481173
H  5.345057 1.006242 1.955121
H  3.861427 -0.804056 -2.488182
H  6.520712 -1.005287 0.927871
