program: Gaussian 09
title: 000206382
version: EM64L-G09RevD.01
frameworkgroup: C1[X(C20H12Cl2N2)]
method: RPBEPBE
basis: SDD
operation: Freq
keyword: #p
keyword: freq=noraman
keyword: PBEPBE/SDD
title: #p freq=noraman PBEPBE/SDD
converged: YES YES NO NO
title: Mulliken charges:
elementType: Cl Cl N N C C C C C C C C C C C C C C C C C C C C H H H H H H H H H H H H
charge: -0.045557 -0.055608 -0.062839 -0.024464 0.214498 0.048215 0.035899 0.326115 -0.190556 -0.305188 0.327646 -0.328238 -0.159410 -0.402442 -0.371474 -0.203022 -0.352599 -0.348603 -0.236708 -0.231695 -0.232135 -0.214265 -0.214432 -0.103641 0.296024 0.270627 0.266874 0.260635 0.263694 0.278543 0.280832 0.234100 0.232766 0.234890 0.255865 0.255651
chargesum: 0.00000
title: Mulliken charges with hydrogens summed into heavy atoms:
elementType: Cl Cl N N C C C C C C C C C C C C C C C C C C C C
charge: -0.045557 -0.055608 -0.062839 -0.024464 0.214498 0.048215 0.035899 0.326115 -0.190556 -0.009164 0.327646 -0.057610 -0.159410 -0.135568 -0.110839 0.060672 -0.074056 -0.067772 -0.002608 0.001072 0.002755 0.041601 0.041219 -0.103641
polarizability: 4.48762050e+02 1.20275512e+01 3.05665735e+02 -1.12034306e+01 -9.78118312e+00 1.07638618e+02
1716.lowfreq: -5.1590 -3.9291 -0.0009 0.0007 0.0017 3.7909 27.6268 38.9574 48.3621
frequency: 27.6108 38.9550 48.3574 57.7782 65.5272 80.9945 88.6462 157.9374 176.1147 185.0793 198.7532 222.7652 241.8037 274.7931 293.7427 319.6056 364.3900 368.1696 395.0655 407.7393 411.9079 438.4875 467.7328 475.5014 490.0858 518.7319 543.6773 595.0034 614.9367 621.7109 628.3071 647.4412 668.4778 693.6603 695.4179 705.3939 742.5209 761.4785 780.7284 807.5185 827.4548 839.3983 842.5974 855.8372 858.1295 861.0694 903.0430 938.2591 959.4128 974.9394 985.3879 985.5104 989.6253 991.3469 997.8035 1001.6912 1027.3393 1059.8848 1068.4709 1069.9104 1087.9955 1101.9131 1123.2453 1161.3026 1173.9296 1175.3989 1192.6261 1240.7512 1260.9706 1276.1199 1293.8855 1303.0805 1323.3629 1360.2506 1378.2102 1381.4638 1394.9392 1400.1312 1413.8166 1433.0078 1462.4183 1481.6326 1492.3096 1495.0735 1540.4537 1580.1297 1584.0534 1595.9603 1607.7985 1611.4936 3129.3880 3137.8431 3149.6279 3159.1018 3160.0585 3160.9458 3161.0117 3170.7926 3176.1928 3176.3823 3180.9604 3181.2303
redmass: 11.0710 4.0157 5.6705 5.7587 5.5224 7.2048 7.2569 8.9271 8.7385 6.1814 11.1181 7.0880 6.8089 6.6379 6.3529 6.3258 10.1639 6.5633 5.0452 2.9272 2.9550 4.0857 7.1476 4.1934 3.5552 7.6134 3.4573 5.9224 6.4448 7.4251 7.4814 8.4401 5.5637 4.8775 6.4022 1.7676 3.2929 3.9691 2.7089 2.3088 7.1105 1.2479 1.8577 1.6104 1.7157 3.9455 1.4992 1.4252 5.3042 1.3386 1.3766 1.5044 3.7488 1.4441 4.1070 1.3280 2.2748 4.6317 2.2756 2.3740 1.6596 1.3358 1.7507 2.1308 1.1972 1.0659 1.1173 1.6498 4.7830 2.1670 1.9252 2.3026 1.4317 3.5909 6.1788 6.9733 5.4828 4.0884 5.7605 2.3519 3.1737 2.7330 3.2215 7.5356 8.6560 8.0666 6.0744 6.4505 6.8744 6.2802 1.0850 1.0882 1.0930 1.0885 1.0962 1.0884 1.0886 1.1008 1.0927 1.0964 1.0974 1.0981
irintensity: 0.0229 0.0694 0.2226 0.1721 0.1857 0.1857 0.1672 2.0579 0.1476 0.2817 0.0158 0.9648 0.5769 0.0682 0.9730 2.8596 15.1005 6.5702 5.8189 0.9749 0.0103 2.5857 7.2163 8.6518 6.2007 3.6550 31.5495 6.7243 0.0428 5.5064 11.0488 36.8539 0.6864 2.8532 11.6293 53.6706 2.6592 13.8329 40.4338 3.3952 3.1133 0.4384 76.4768 26.9889 14.5519 34.2007 8.7621 0.8032 17.1629 0.6243 3.6360 5.1190 0.4936 3.6336 73.8518 0.4996 6.2251 2.3379 36.0261 71.3775 14.3514 10.8882 6.0101 35.8598 25.6974 1.8757 6.9666 18.8677 3.6445 0.6154 0.0478 97.4127 19.0728 30.0855 18.8800 26.4238 106.7509 54.8313 100.7967 17.9424 26.2768 56.2768 55.1861 388.2993 46.6659 4.5393 2.5821 39.0529 40.0195 9.5857 0.8667 3.7360 21.1221 0.4809 19.8469 0.2627 0.9372 19.1940 1.8171 4.3086 7.1592 5.1300
temp: 298.150 k
press: 1.00000 atm
elementType: 17 17 7 7 6 6 6 6 6 6 6 6 6 6 6 6 6 6 6 6 6 6 6 6 1 1 1 1 1 1 1 1 1 1 1 1
symmnumber: 1
zpe: 683252.6 jmol-1
zpe.correction: 0.260237 hartree
zpe.thermalcorrener: 0.279276 hartree
zpe.thermalcorrenthalpy: 0.280221 hartree
zpe.thermalcorrgfe: 0.210733 hartree
zpe.sumelectzpe: -1797.359725 hartree
zpe.sumelectthermal: -1797.340685 hartree
zpe.sumelectthermalent: -1797.339741 hartree
zpe.sumelectthermalfe: -1797.409229 hartree
dipole: -2.8433 1.0248 0.0350
dipole: 3.0225
quadrupole: -165.6863 -129.2446 -154.7089
quadrupole: -6.5619 -4.6254 -2.5593
quadrupole: -15.8063 20.6353 -4.8289 -6.5619 -4.6254 -2.5593
hfenergy: -1797.6199619 hartree
pointgroup: C01[X(C20H12Cl2N2)]
dipole: -1.1572761 -0.2658463 -0.0643214 debye
polarizability: 441.9478734|-27.6942063|309.9380745|27.1325838|-17.4804785|110.1804549 unknown
InChI: InChI=1S/C20H12Cl2N2/c21-15-8-6-14(7-9-15)20-23-18-11-10-16(22)12-17(18)19(24-20)13-4-2-1-3-5-13/h1-12H
charge 0 multiplicity 1
36 atoms
Cl -5.089386 3.05388 0.032188
Cl 7.167688 -0.683496 0.449767
N  0.320305 -0.598374 0.059149
N  0.787551 1.780316 -0.147445
C  -1.550354 0.956759 -0.074595
C  -1.013755 -0.393372 -0.01742
C  -0.573946 2.023804 -0.175008
C  -1.864199 -1.616992 -0.044541
C  1.179272 0.493968 0.013402
C  -2.939932 1.287129 0.005536
C  2.63174 0.205908 0.118089
C  -1.021328 3.37947 -0.279807
C  -3.3226 2.623651 -0.07863
C  -2.981416 -1.738502 -0.915533
C  -1.510113 -2.720604 0.777684
C  -2.382741 3.683314 -0.238079
C  3.573918 1.269669 0.126812
C  3.096221 -1.133394 0.209828
C  -3.736017 -2.93104 -0.946899
C  -2.274443 -3.904765 0.756166
C  -3.392629 -4.013569 -0.104684
C  4.954289 1.006569 0.227814
C  4.474769 -1.410937 0.311683
C  5.383032 -0.333744 0.319477
H  -3.687058 0.505016 0.157986
H  -0.26375 4.162658 -0.372313
H  -3.232908 -0.923735 -1.602851
H  -0.632626 -2.630619 1.425673
H  -2.733404 4.71688 -0.307546
H  3.204976 2.296512 0.052388
H  2.362901 -1.944226 0.193339
H  -4.585093 -3.017654 -1.633485
H  -1.998344 -4.742939 1.405114
H  -3.983962 -4.935591 -0.1256
H  5.682619 1.822404 0.235613
H  4.836821 -2.440555 0.380228
