program: Gaussian 09
title: 000206380
version: EM64L-G09RevD.01
frameworkgroup: C1[X(C11H14N2O2)]
method: RPBEPBE
basis: SDD
operation: Freq
keyword: #p
keyword: freq=noraman
keyword: PBEPBE/SDD
title: #p freq=noraman PBEPBE/SDD
converged: NO YES NO NO
title: Mulliken charges:
elementType: O O N N C C C C C C C C C C C H H H H H H H H H H H H H H
charge: -0.255465 -0.278416 -0.188461 -0.212147 0.200489 -0.487547 -0.445003 -0.508276 0.069412 0.142906 0.226982 -0.615286 -0.425197 -0.025509 -0.558756 0.240323 0.240231 0.232029 0.231882 0.242677 0.242478 0.286437 0.232454 0.232817 0.251086 0.238557 0.250056 0.213110 0.226137
chargesum: 0.00000
title: Mulliken charges with hydrogens summed into heavy atoms:
elementType: O O N N C C C C C C C C C C C
charge: -0.255465 -0.278416 -0.188461 -0.212147 0.200489 -0.006993 0.018909 -0.023121 0.069412 0.142906 0.226982 0.136423 0.064446 0.224547 -0.119509
polarizability: 1.69696001e+02 -5.00399469e+00 1.51510353e+02 -7.72279843e-01 2.63840232e+00 8.72239848e+01
1716.lowfreq: -101.2212 -9.6816 -4.4864 -0.0006 -0.0002 0.0004 3.7145 42.0758 51.1776
frequency: -101.2051 41.8766 51.1544 83.3471 95.4880 116.7928 145.6094 151.7842 201.0664 252.6942 296.4529 306.8913 328.7795 369.8863 396.2781 405.7567 446.3969 479.8776 513.2015 540.8324 607.7088 684.0753 705.6386 726.8631 731.0650 749.7613 757.3410 872.6069 883.8998 905.6727 918.8049 940.9581 956.0829 969.9610 1012.0559 1026.4635 1041.3264 1044.4433 1078.5124 1123.9356 1126.8320 1146.5948 1180.5337 1194.0216 1213.7220 1231.2270 1239.9517 1262.7920 1279.0412 1292.1776 1307.4074 1320.4914 1342.9627 1357.0977 1415.6666 1428.1385 1443.1619 1448.7497 1459.6101 1472.3443 1482.7072 1489.3239 1493.4580 1578.1637 1627.9332 1656.2179 1661.9035 2980.3296 2994.4867 2997.9030 3024.4921 3030.1070 3031.6759 3040.4056 3081.6506 3089.0307 3091.9633 3106.5708 3123.8858 3126.3241 3201.7840
redmass: 1.5939 3.7150 4.2660 3.0971 2.9903 1.4441 1.7584 5.4328 3.0709 3.7345 3.1763 4.3525 4.3089 4.7798 2.6467 5.4897 3.8671 3.4490 5.0069 3.5095 3.7903 2.6565 7.1054 5.4352 5.3427 3.7058 1.3382 4.2427 1.8321 1.4517 2.5988 2.5360 1.3962 2.9773 1.1553 3.3825 1.7326 4.1389 2.7037 1.2933 2.5563 1.1749 2.6231 1.2026 1.7757 4.8220 1.0734 1.7707 1.2542 1.8203 1.5636 1.5289 2.1028 1.8428 1.4491 1.1825 1.1358 1.4927 1.4182 1.0821 1.2840 1.1271 1.0456 9.5079 9.7973 8.6276 4.7065 1.0588 1.0350 1.0599 1.1021 1.0620 1.0610 1.1030 1.1030 1.1049 1.0601 1.0985 1.0982 1.0990 1.1148
irintensity: 0.5678 0.8475 2.8748 0.1772 3.4188 0.0645 0.8253 1.9146 4.6145 3.2478 3.9979 0.0484 4.4989 10.6231 7.3981 9.9532 7.9460 9.7710 3.5825 2.3886 7.9207 20.0501 0.6780 2.5973 6.8074 25.5672 1.4150 7.3092 16.6495 0.4745 7.7371 9.4563 74.8120 3.1818 23.9556 3.9440 0.0326 5.1965 17.0557 0.2604 43.9569 0.0751 9.2369 0.2007 4.1802 37.5057 0.3074 0.1504 1.8330 58.6380 24.3221 9.8583 9.2483 30.0013 9.8963 21.8885 42.0758 54.3059 86.4416 7.6571 101.7353 45.7045 21.4084 285.7542 203.4451 343.3867 16.7919 19.0954 60.4964 22.3399 8.5202 59.8937 12.0993 6.5585 20.0079 41.8192 6.8977 2.3176 5.5879 0.3787 22.4634
temp: 298.150 k
press: 1.00000 atm
elementType: 8 8 7 7 6 6 6 6 6 6 6 6 6 6 6 1 1 1 1 1 1 1 1 1 1 1 1 1 1
symmnumber: 1
zpe: 616281.3 jmol-1
zpe.correction: 0.234729 hartree
zpe.thermalcorrener: 0.248457 hartree
zpe.thermalcorrenthalpy: 0.249402 hartree
zpe.thermalcorrgfe: 0.193591 hartree
zpe.sumelectzpe: -686.416873 hartree
zpe.sumelectthermal: -686.403145 hartree
zpe.sumelectthermalent: -686.402201 hartree
zpe.sumelectthermalfe: -686.458011 hartree
dipole: 4.6231 2.4575 1.0457
dipole: 5.3391
quadrupole: -78.8293 -96.3807 -86.6004
quadrupole: 4.7315 -0.4390 -0.7859
quadrupole: 8.4409 -9.1106 0.6697 4.7315 -0.4390 -0.7859
hfenergy: -686.6516023 hartree
pointgroup: C01 [X(C11H14N2O2)]
dipole: -1.8004758 -1.0001953 0.4125688 debye
polarizability: 169.8112269|-4.819324|151.4931498|-0.7422134|-0.6420421|87.1259622 unknown
InChI: InChI=1S/C11H14N2O2/c1-3-7-13-10(14)8-5-4-6-9(8)12(2)11(13)15/h3H,1,4-7H2,2H3
charge 0 multiplicity 1
29 atoms
O  0.496915 2.490229 -0.37616
O  1.569463 -2.089505 -0.535781
N  -0.654613 -1.48207 -0.084205
N  1.018601 0.195619 -0.4566
C  -1.589379 -0.46692 0.085659
C  -3.054652 -0.691019 0.39258
C  -3.639118 0.762028 0.487441
C  -2.4597 1.764525 0.217788
C  -1.26541 0.867626 -0.009837
C  0.093304 1.2902 -0.284127
C  0.708681 -1.177983 -0.369527
C  -1.034293 -2.90567 0.022276
C  2.448636 0.549677 -0.715168
C  3.200545 0.827223 0.573452
C  4.235168 0.073848 1.018615
H  -3.545864 -1.286849 -0.401122
H  -3.187223 -1.255344 1.33604
H  -4.078434 0.93449 1.484408
H  -4.447194 0.900387 -0.250509
H  -2.290791 2.448843 1.069573
H  -2.65205 2.408078 -0.660433
H  -0.125346 -3.502824 -0.143037
H  -1.786661 -3.166684 -0.742379
H  -1.439444 -3.126295 1.025189
H  2.43264 1.455196 -1.346862
H  2.902664 -0.290998 -1.261634
H  2.863923 1.70811 1.136962
H  4.76572 0.319511 1.945675
H  4.574511 -0.81343 0.470926
