program: Gaussian 09
title: 000206370
version: EM64L-G09RevD.01
frameworkgroup: C1[X(C14H20N2O2)]
method: RPBEPBE
basis: SDD
operation: Freq
keyword: #p
keyword: freq=noraman
keyword: PBEPBE/SDD
title: #p freq=noraman PBEPBE/SDD
converged: YES YES NO NO
title: Mulliken charges:
elementType: O O N N C C C C C C C C C C C C C C H H H H H H H H H H H H H H H H H H H H
charge: -0.260052 -0.285216 -0.283472 -0.191437 0.041450 -0.437651 -0.437630 -0.398052 -0.398029 -0.390972 0.037229 0.192006 -0.509614 0.179101 -0.488752 -0.445834 0.201756 -0.618645 0.239263 0.252884 0.197841 0.197840 0.252890 0.197937 0.193871 0.193859 0.197946 0.195223 0.198787 0.242178 0.242200 0.238980 0.239049 0.231091 0.231146 0.231651 0.287528 0.231651
chargesum: 0.00000
title: Mulliken charges with hydrogens summed into heavy atoms:
elementType: O O N N C C C C C C C C C C C C C C
charge: -0.260052 -0.285216 -0.283472 -0.191437 0.280712 0.013075 0.013100 -0.006244 -0.006224 0.003038 0.037229 0.192006 -0.025236 0.179101 -0.010723 0.016403 0.201756 0.132185
polarizability: 2.12722748e+02 -5.48138373e+00 1.72530820e+02 -1.87638052e-02 1.13722248e-02 1.16888230e+02
1716.lowfreq: -94.0458 -12.9385 -6.2231 -4.1875 0.0004 0.0006 0.0008 42.1171 49.2598
frequency: -94.0004 41.8154 49.1043 68.9898 93.5298 106.7435 139.6582 164.1703 197.3132 199.7239 219.2885 219.9681 268.1139 305.1213 328.0343 343.1989 397.0605 405.3407 438.3008 441.2374 455.5719 477.2867 504.4452 543.4016 573.9568 647.1846 704.7924 726.6117 739.1698 752.6178 758.2384 789.3840 790.9050 838.7042 874.5842 883.3442 899.5482 904.5251 922.0933 924.8729 957.5356 986.3131 1026.5733 1041.3841 1045.2001 1050.3300 1060.3459 1075.9733 1098.1596 1109.5780 1123.6853 1125.9122 1144.5887 1163.8374 1191.3197 1196.7304 1211.0679 1222.8673 1236.4875 1248.8287 1259.1420 1259.6460 1262.9491 1293.6328 1307.3459 1308.3105 1328.9842 1331.5655 1339.6920 1344.9561 1348.4939 1351.6590 1382.0170 1417.4987 1450.1732 1460.4872 1460.8384 1464.2675 1471.0218 1472.1088 1473.1091 1483.4780 1483.9239 1490.4296 1493.6890 1570.0105 1618.7650 1662.4264 2965.0082 2965.5381 2971.7269 2979.9090 2993.3474 2994.5828 2995.7381 2998.5867 3024.0972 3027.3188 3027.6994 3029.5913 3029.8295 3039.3268 3041.1505 3066.8721 3074.9073 3081.1142 3088.6375 3127.8842
redmass: 1.5938 4.4730 3.1259 3.3526 3.3908 1.3800 2.0230 5.5659 3.7536 3.0180 4.8336 1.7995 3.8761 4.3300 1.7918 4.4670 4.4724 5.0495 5.7446 3.8824 3.6894 1.8322 6.0198 3.9203 4.3661 3.9719 7.8039 5.6579 5.6055 5.8522 1.2510 2.5856 1.4278 2.3735 2.0717 3.1562 1.6230 1.4443 1.7058 2.6700 4.1529 2.6413 3.2870 1.7270 1.8286 3.7541 1.1372 1.3454 4.9245 2.5906 1.2912 2.4990 1.1773 2.5928 1.2064 1.6399 1.8271 5.3125 1.0736 1.3272 1.2651 1.5490 1.5601 1.8472 1.3497 1.6652 1.4101 1.3490 1.4600 1.4234 4.6547 1.3015 1.3538 1.4488 1.3847 1.4113 1.1338 1.0880 1.0855 1.0858 1.0829 1.3404 1.1019 1.1309 1.0449 9.0769 10.4067 8.7819 1.0623 1.0622 1.0629 1.0588 1.0625 1.0352 1.0636 1.0599 1.1022 1.0989 1.0864 1.0842 1.0706 1.1032 1.1030 1.1010 1.0990 1.1028 1.1049 1.0989
irintensity: 0.6275 3.8816 0.6506 0.8942 1.5692 0.0648 0.1830 1.0072 6.4887 1.7527 2.4950 0.0360 7.8014 0.0023 0.3443 4.5824 0.0020 5.8526 27.4002 0.3171 9.6929 0.4655 4.1060 1.4121 0.5899 21.6052 0.0159 0.3630 24.3734 0.2720 3.4183 3.8788 0.4664 4.4500 6.8665 3.2712 19.5075 0.6972 0.0368 3.0657 0.3886 31.4222 5.2540 0.0471 0.3264 8.8094 1.3792 0.4371 14.5141 0.0455 0.0983 56.2101 0.0331 9.2560 0.2208 0.0632 13.5382 32.8112 0.1821 4.3733 0.2535 0.9404 3.5821 60.4422 1.0027 48.9330 38.1151 0.3618 0.2122 1.8552 35.3134 0.5749 2.9943 29.6363 30.5553 83.2709 7.4320 4.8285 8.4924 16.4023 6.2896 104.4667 0.7124 40.7773 20.2258 308.8199 218.2166 298.7002 24.1919 49.0374 37.0309 20.8093 51.2354 60.8878 22.3343 21.0928 8.3360 66.9543 54.2780 67.5368 19.1231 51.9237 6.4237 1.2011 33.0999 20.6670 41.9653 0.4908
temp: 298.150 k
press: 1.00000 atm
elementType: 8 8 7 7 6 6 6 6 6 6 6 6 6 6 6 6 6 6 1 1 1 1 1 1 1 1 1 1 1 1 1 1 1 1 1 1 1 1
symmnumber: 1
zpe: 846765.6 jmol-1
zpe.correction: 0.322516 hartree
zpe.thermalcorrener: 0.338544 hartree
zpe.thermalcorrenthalpy: 0.339489 hartree
zpe.thermalcorrgfe: 0.278955 hartree
zpe.sumelectzpe: -804.117438 hartree
zpe.sumelectthermal: -804.101409 hartree
zpe.sumelectthermalent: -804.100465 hartree
zpe.sumelectthermalfe: -804.160999 hartree
dipole: -4.5944 0.9202 0.0045
dipole: 4.6856
quadrupole: -86.5517 -117.4008 -106.1828
quadrupole: -3.0008 -0.0009 -0.0045
quadrupole: 16.8267 -14.0224 -2.8044 -3.0008 -0.0009 -0.0045
hfenergy: -804.4399537 hartree
pointgroup: C01 [X(C14H20N2O2)]
dipole: -1.810388 -0.3476678 0.0045323 debye
polarizability: 212.8063546|5.161209|172.4462332|-0.3049012|-0.0465148|116.8892098 unknown
InChI: InChI=1S/C14H20N2O2/c1-15-12-9-5-8-11(12)13(17)16(14(15)18)10-6-3-2-4-7-10/h10H,2-9H2,1H3
charge 0 multiplicity 1
38 atoms
O  0.401486 2.120897 0.009988
O  0.139632 -2.602142 0.01292
N  0.294368 -0.24686 0.011078
N  -1.845596 -1.362801 0.018329
C  1.797162 -0.365486 0.005491
C  2.420491 0.225886 -1.283347
C  2.430913 0.227664 1.288456
C  3.951363 -0.008835 -1.279462
C  3.961693 -0.007348 1.27274
C  4.608242 0.57734 -0.006321
C  -1.757956 1.056929 0.016731
C  -2.467154 -0.120324 0.019322
C  -2.660884 2.268438 0.018546
C  -0.307765 1.067153 0.012477
C  -3.965072 0.096875 0.02327
C  -4.109552 1.659835 0.021481
C  -0.424289 -1.467393 0.0139
C  -2.629475 -2.614932 0.021377
H  1.98341 -1.455082 0.005531
H  2.205971 1.307521 -1.335626
H  1.961809 -0.255158 -2.168887
H  1.979133 -0.251902 2.178333
H  2.217161 1.309441 1.340857
H  4.397471 0.444875 -2.185482
H  4.161224 -1.097742 -1.329262
H  4.171811 -1.096222 1.322127
H  4.415025 0.447398 2.174642
H  5.69682 0.374164 -0.010642
H  4.483116 1.679482 -0.006443
H  -2.473654 2.906249 0.901968
H  -2.477232 2.906214 -0.865642
H  -4.442485 -0.366537 -0.861919
H  -4.437426 -0.364078 0.912449
H  -4.672879 1.994573 0.9088
H  -4.67531 1.992166 -0.865203
H  -3.26266 -2.675464 0.923805
H  -1.915331 -3.451336 0.020078
H  -3.267483 -2.676856 -0.877558
