program: Gaussian 09
title: 000206369
version: EM64L-G09RevD.01
frameworkgroup: C1[X(C9H12N2O2)]
method: RPBEPBE
basis: SDD
operation: Freq
keyword: #p
keyword: freq=noraman
keyword: PBEPBE/SDD
title: #p freq=noraman PBEPBE/SDD
converged: NO NO NO NO
title: Mulliken charges:
elementType: O O N N C C C C C C C C C H H H H H H H H H H H H
charge: -0.259453 -0.276826 -0.181047 -0.214902 0.206383 -0.487303 -0.444496 -0.506405 0.078276 0.144288 0.213954 -0.615946 -0.602242 0.240113 0.240212 0.231837 0.231875 0.242572 0.242630 0.286198 0.232609 0.232497 0.270596 0.247140 0.247439
chargesum: 0.00000
title: Mulliken charges with hydrogens summed into heavy atoms:
elementType: O O N N C C C C C C C C C
charge: -0.259453 -0.276826 -0.181047 -0.214902 0.206383 -0.006978 0.019216 -0.021203 0.078276 0.144288 0.213954 0.135359 0.162933
polarizability: 1.37705122e+02 5.07833371e-01 1.39024168e+02 3.92790440e-02 -1.91082148e-02 6.78881364e+01
1716.lowfreq: -98.9416 -12.4456 -0.0008 -0.0007 -0.0005 9.0102 9.6542 81.2161 106.7352
frequency: -98.9313 81.1420 106.7122 117.0743 120.9744 151.5307 161.5520 254.3218 292.1150 308.0196 309.4156 357.5183 392.9204 421.6311 476.1664 514.2222 536.9964 623.7956 705.8038 725.4068 735.3354 736.3380 757.2808 870.2390 904.9768 923.4214 933.6713 1022.4069 1034.7979 1042.0113 1054.1636 1123.4133 1128.9972 1129.1670 1146.9198 1192.7446 1214.3861 1232.8906 1239.9126 1252.4019 1265.0540 1298.4723 1313.7916 1347.4173 1407.0245 1429.2754 1448.8658 1459.6248 1471.5531 1474.6950 1476.5657 1484.9279 1489.5800 1493.5852 1580.3150 1630.3598 1660.1886 2979.6229 2993.8031 2998.3322 3009.3210 3024.1983 3029.8618 3041.4655 3080.1481 3089.1042 3100.0357 3125.0816 3137.5712
redmass: 1.5984 3.4222 2.2120 1.2545 1.3302 3.1826 2.4821 3.7742 4.7007 4.3545 2.8093 4.2653 8.3050 5.9672 7.2928 6.2101 3.7337 5.3928 7.3193 5.7419 6.0267 5.4520 1.2266 4.6226 1.4512 2.5533 4.4476 3.1071 3.4054 1.7330 3.8312 1.2931 2.5542 1.3249 1.1749 1.2020 1.7939 2.5871 1.0730 3.7977 1.7898 1.8477 1.9308 4.6130 1.4061 1.2794 1.5329 1.3423 1.0805 1.0469 1.0578 1.3069 1.1581 1.0443 9.1189 9.4315 9.0451 1.0588 1.0351 1.0599 1.0329 1.1024 1.0619 1.1032 1.1029 1.1049 1.1020 1.0991 1.1022
irintensity: 0.5107 0.2692 5.5947 2.4430 0.5711 4.1702 1.9178 3.3240 0.3269 0.0174 1.5499 10.2481 23.8134 8.5492 10.6567 1.3230 2.2595 11.1013 0.0043 0.8432 27.5049 0.2840 4.3473 3.8606 0.5699 6.8539 18.1206 20.8146 8.5295 0.0310 22.4400 0.1580 27.9941 0.6556 0.0415 0.1618 1.9541 6.0816 0.2424 9.1900 0.3456 25.3943 40.3046 22.8706 7.4653 77.4990 53.4639 70.4131 5.5201 16.2347 6.1206 100.6446 68.8055 21.0298 323.7063 194.7219 385.0036 18.5569 60.3555 22.7544 27.5734 8.5296 53.7662 6.5075 21.0782 41.6700 18.8557 0.3329 0.9752
temp: 298.150 k
press: 1.00000 atm
elementType: 8 8 7 7 6 6 6 6 6 6 6 6 6 1 1 1 1 1 1 1 1 1 1 1 1
symmnumber: 1
zpe: 530380.1 jmol-1
zpe.correction: 0.202011 hartree
zpe.thermalcorrener: 0.213602 hartree
zpe.thermalcorrenthalpy: 0.214546 hartree
zpe.thermalcorrgfe: 0.164547 hartree
zpe.sumelectzpe: -609.171682 hartree
zpe.sumelectthermal: -609.160091 hartree
zpe.sumelectthermalent: -609.159147 hartree
zpe.sumelectthermalfe: -609.209147 hartree
dipole: -4.0428 3.3244 -0.0035
dipole: 5.2341
quadrupole: -74.0833 -83.4698 -75.2654
quadrupole: -6.9486 -0.0084 0.0038
quadrupole: 3.5229 -5.8636 2.3407 -6.9486 -0.0084 0.0038
hfenergy: -609.3736933 hartree
pointgroup: C01 [X(C9H12N2O2)]
dipole: -1.5260593 1.3825565 -0.0135139 debye
dipolederiv: -0.554028 0.1374328 -0.0019417 0.04521 -1.3302679 -0.007457 -0.0021173 -0.0047861 -0.3629202 -1.1490897 -0.4206269 -0.0154494 -0.3577298 -0.7606184 -0.0086995 -0.0160042 -0.0104194 -0.3727349 -1.1420013 -0.5988439 -0.0208041 0.21671 -0.801598 -0.0023153 -0.0139402 -0.0141016 -0.1500089 -0.7923341 -0.2509601 -0.0116811 -0.2994993 -1.0857604 -0.0116226 -0.0103543 -0.0118171 -0.2028832 0.5550739 0.5007782 0.012727 0.00024 0.8548078 0.0069999 0.0090057 0.0138432 0.013565 -0.0977138 -0.0106245 -0.0041703 0.0644004 -0.0156953 -0.000363 -0.0037286 -0.0011246 0.1647155 0.1261025 0.0046546 -0.0001204 0.026141 -0.0103826 -0.0008043 -0.0001833 -0.0011699 0.1443447 0.0464205 0.0302362 -0.0017811 -0.0211592 0.0449124 -0.0014542 -0.0022734 -0.0004694 0.1859881 -0.2925106 0.5060165 0.0015945 0.3522464 -0.7277064 0.0006678 0.0002946 0.0027281 -0.1329388 1.0780782 -0.1919918 0.011545 0.109356 1.6539904 0.0128984 0.0139456 0.0076127 0.2348762 1.6156115 0.3887478 0.0248076 0.1120848 1.1740928 0.0095506 0.0230883 0.0145743 0.2573421 -0.0200844 -0.0077042 -0.0036718 -0.0872767 0.5210317 0.0016137 -0.0041049 0.0026477 0.2182795 0.2955685 -0.1149927 0.001952 -0.1942936 0.1235729 -0.0045231 0.0005866 -0.003226 0.200026 0.0329345 0.0365884 0.0027898 0.0106535 -0.0189003 -0.0929202 0.0352325 -0.1318582 -0.035461 0.0339004 0.0326809 -0.0001808 0.0081793 -0.0221941 0.0934188 -0.0328414 0.1330884 -0.0331995 -0.0430256 -0.0004795 -0.0955232 0.001323 0.0618545 0.0064024 -0.1551106 0.0046726 -0.0590896 -0.0500918 -0.001879 0.0956325 -0.0009392 0.0619242 -0.0045694 0.1553646 -0.0028729 -0.0520276 0.0120038 -0.0327376 -0.0226813 -0.0305004 -0.0057534 -0.0884013 -0.0618814 -0.1178658 -0.0445193 0.009565 -0.036627 0.0236149 -0.0342123 -0.009167 0.0879205 0.0628785 0.1173164 -0.0383705 0.0424923 -0.1465527 -0.0022573 -0.0069707 0.1445143 -0.0000912 -0.0012304 -0.0022351 0.1340365 0.0627017 0.0990086 0.10642 0.040033 -0.0156648 -0.0114873 0.0919627 -0.0748765 -0.0525585 0.0679565 0.0989281 -0.1015122 0.0413164 -0.0166957 0.0132861 -0.0879931 0.0779547 -0.0561819 0.1799508 -0.0839331 -0.0011947 0.0661076 -0.0142916 -0.0022656 0.0005475 -0.0036592 0.1260047 -0.0067498 0.0330753 -0.0563189 -0.026805 0.0980792 -0.0720211 -0.0875465 -0.0195893 -0.0488601 -0.0107309 0.0298055 0.0582053 -0.0346154 0.0959156 0.076237 0.086403 0.0256332 -0.0374241 unknown
polarizability: 137.7387243|0.5594481|138.9680376|1.1226086|0.5754152|67.9106652 unknown
InChI: InChI=1S/C9H12N2O2/c1-10-7-5-3-4-6(7)8(12)11(2)9(10)13/h3-5H2,1-2H3
charge 0 multiplicity 1
25 atoms
O  0.456601 -2.754744 -0.020023
O  2.591932 1.440347 0.047547
N  0.239097 1.390877 0.009433
N  1.516618 -0.640385 0.011847
C  -0.918868 0.62468 -0.014892
C  -2.322386 1.193348 -0.032174
C  -3.238419 -0.080591 -0.05539
C  -2.297221 -1.338848 -0.051797
C  -0.904803 -0.751806 -0.025926
C  0.341016 -1.49175 -0.012954
C  1.520582 0.766006 0.023913
C  0.194277 2.866667 0.021996
C  2.846532 -1.289561 0.027568
H  -2.511197 1.826189 0.856779
H  -2.483953 1.839006 -0.917309
H  -3.880966 -0.075316 -0.952001
H  -3.906328 -0.089234 0.822454
H  -2.447913 -1.974352 -0.943742
H  -2.474442 -1.989187 0.824422
H  1.233423 3.227427 0.039052
H  -0.335201 3.233685 0.918652
H  -0.311402 3.24958 -0.881658
H  2.676254 -2.375731 0.00369
H  3.39851 -1.003812 0.938358
H  3.435759 -0.968199 -0.847044
