program: Gaussian 09
title: 000206361
version: EM64L-G09RevD.01
frameworkgroup: C1[X(C10H12ClNO2)]
method: RPBEPBE
basis: SDD
operation: Freq
keyword: #p
keyword: freq=noraman
keyword: PBEPBE/SDD
title: #p freq=noraman PBEPBE/SDD
converged: YES YES NO NO
title: Mulliken charges:
elementType: Cl O O N C C C C C C C C C C H H H H H H H H H H H H
charge: -0.098316 -0.445055 -0.207052 0.035230 -0.358184 -0.537723 -0.301612 0.527787 -0.649921 -0.332669 -0.557284 -0.250400 -0.019643 0.148275 0.240818 0.219322 0.240714 0.208017 0.265317 0.246233 0.233991 0.213047 0.254472 0.256814 0.281214 0.386607
chargesum: 0.00000
title: Mulliken charges with hydrogens summed into heavy atoms:
elementType: Cl O O N C C C C C C C C C C
charge: -0.098316 -0.058448 -0.207052 0.035230 0.101956 -0.088992 -0.036295 0.527787 0.043350 -0.078197 -0.300470 0.030814 -0.019643 0.148275
polarizability: 1.90569530e+02 -2.50350741e+00 1.22716625e+02 1.00857355e+01 5.03230867e+00 8.33400523e+01
1716.lowfreq: -14.9607 0.0017 0.0022 0.0025 3.4068 5.8591 20.4835 28.4530 45.9282
frequency: 17.8102 28.0757 45.9053 53.3241 103.2448 122.6282 171.9145 187.6671 231.2601 273.4808 321.9443 325.3424 340.1349 399.4961 404.9852 419.7103 480.7477 517.9649 549.2273 585.9224 599.8836 629.3588 689.8647 712.9476 774.1816 792.5240 820.9648 867.0818 906.9204 939.4898 955.9000 996.8945 1000.0450 1005.7307 1018.5440 1040.5943 1096.7454 1108.6589 1136.1300 1163.0821 1168.3480 1226.8685 1236.2607 1261.3166 1284.7959 1291.0090 1310.1059 1318.7702 1332.4958 1355.6588 1377.3808 1392.0063 1444.7182 1461.5734 1464.5032 1473.5590 1479.0267 1546.3548 1584.3632 1670.1858 2972.0581 2984.1434 2989.3763 3030.9034 3052.3954 3062.6472 3081.2555 3110.3937 3115.3229 3135.2023 3188.6611 3532.3645
redmass: 5.5355 6.9976 5.0717 6.7695 4.0761 4.3454 3.6494 4.6449 1.0866 3.5850 2.8728 3.7307 4.2546 3.0582 4.0232 3.6973 6.5930 3.2458 3.6188 1.7390 2.3157 7.7731 3.8624 4.4797 1.2444 5.1036 5.7689 1.6298 1.7023 1.4105 1.5404 2.5012 1.4746 4.3826 2.5029 2.1719 2.1115 1.4534 1.4078 1.6380 1.9157 2.1518 1.2882 1.3594 1.2416 1.5506 2.6699 1.4206 5.6589 1.5867 1.9214 1.2140 1.0860 1.0569 2.6709 1.0500 1.0995 5.9503 6.1433 9.3254 1.0607 1.0394 1.0600 1.0954 1.0955 1.0973 1.0953 1.1006 1.0915 1.0917 1.0953 1.0643
irintensity: 4.2894 3.2891 0.1088 0.1732 0.9470 1.0390 0.1839 1.3071 0.2693 1.5698 1.0264 4.3058 4.5559 13.5093 3.2099 6.4564 5.1852 24.5545 17.7196 70.6823 56.7758 6.7858 70.6499 10.4007 8.4751 3.5847 2.3799 30.1571 2.0637 0.9537 4.7105 39.0625 8.3921 226.5723 76.6415 8.3910 15.5683 7.6626 47.8241 12.6841 37.0505 3.1275 23.7165 6.6895 16.2542 7.3524 52.9956 8.9983 12.4494 1.9014 8.9246 19.3650 3.4880 11.4535 13.2044 9.6991 10.4920 17.4463 31.2751 265.8842 7.2531 19.6647 26.3167 0.4739 2.8971 23.4416 31.3914 27.5398 23.7954 10.4889 0.7359 43.8258
temp: 298.150 k
press: 1.00000 atm
elementType: 17 8 8 7 6 6 6 6 6 6 6 6 6 6 1 1 1 1 1 1 1 1 1 1 1 1
symmnumber: 1
zpe: 530964.6 jmol-1
zpe.correction: 0.202234 hartree
zpe.thermalcorrener: 0.216384 hartree
zpe.thermalcorrenthalpy: 0.217328 hartree
zpe.thermalcorrgfe: 0.158139 hartree
zpe.sumelectzpe: -1052.488942 hartree
zpe.sumelectthermal: -1052.474791 hartree
zpe.sumelectthermalent: -1052.473847 hartree
zpe.sumelectthermalfe: -1052.533037 hartree
dipole: -2.9314 1.0685 1.6913
dipole: 3.5490
quadrupole: -100.5772 -90.0788 -88.6667
quadrupole: 24.1957 0.2608 1.0095
quadrupole: -7.4696 3.0288 4.4409 24.1957 0.2608 1.0095
hfenergy: -1052.6911753 hartree
pointgroup: C01 [X(C10H12Cl1N1O2)]
dipole: -1.1279363 0.5512647 0.611101 debye
dipolederiv: -0.3915856 0.0969924 -0.0548212 0.1618785 -0.4700411 0.2430777 -0.0565257 0.1854638 -0.3771708 -0.6761618 -0.3905821 -0.1161911 -0.5264688 -0.9651794 -0.2073547 -0.1618312 -0.1945063 -0.4976354 -0.9649533 0.331486 -0.0470859 0.1957286 -0.7545556 -0.061572 -0.0988867 -0.0229355 -0.3272932 -0.1472211 -0.0569884 0.0019211 0.1529479 -0.282064 0.0057986 0.0392499 -0.0307392 -0.2010823 -0.1322068 -0.0044479 -0.0049017 0.0444987 0.0292645 0.0388334 -0.2628667 0.0379014 0.0017469 -0.2381462 0.0090782 0.0417098 0.0958223 0.144401 0.0435421 0.1797893 0.0456349 0.0654144 0.466972 -0.1390739 0.0843418 -0.1884176 0.6225693 -0.2856 0.2519137 -0.2811347 0.4416392 0.5819878 0.0358684 0.0344804 -0.124357 -0.1191418 -0.0743403 0.0678479 -0.034727 -0.0115102 -0.1557726 0.0275885 0.0650498 0.0187694 -0.0202726 0.0816072 0.0387825 0.0379066 -0.0910103 -0.1296887 -0.0928643 0.0126509 -0.1980177 0.1014677 0.0263284 -0.0408219 0.0303089 -0.1192345 -0.2142154 0.0386524 0.0188431 0.3055544 0.2669509 0.1371178 0.0509649 0.0812383 -0.0418093 -0.0366675 0.0616957 0.0086137 0.0339369 -0.0239857 0.0121838 0.010846 0.0216172 -0.0642745 -0.3781134 0.0744788 -0.0395988 -0.1033999 0.0536201 -0.0204855 -0.113169 0.0188348 0.0358157 1.8426433 -0.054253 0.2773728 0.1452269 1.3631932 0.2666742 0.3763058 0.2258306 0.3329744 0.0514835 -0.0340429 -0.0145715 -0.0563897 -0.0258793 -0.1118586 -0.0089864 -0.072516 0.0041058 0.0327039 0.0758 -0.0378528 0.0115504 -0.0468035 0.1125313 -0.0068951 0.0842174 0.0037863 0.0735074 0.0066644 -0.0475579 -0.0202323 -0.0166343 0.0921125 -0.0362812 0.0419251 0.0316003 0.0201425 -0.0224722 -0.0146557 -0.0658877 -0.0689697 -0.1225037 -0.0310885 -0.0674436 0.0066923 0.0258445 0.0188064 -0.0118836 -0.0029823 -0.0995439 -0.044385 -0.0577152 -0.0458514 -0.0584778 -0.1596208 -0.0113261 -0.0014476 0.008546 0.1149519 -0.0091286 -0.0234303 0.0015477 0.0768397 0.0921087 -0.0690588 -0.0407296 -0.0343248 -0.0164593 -0.1264294 -0.0137895 -0.0713584 0.0095442 0.1027132 0.0567105 -0.0075335 0.0471801 -0.0757944 0.0989743 -0.0052295 0.1088533 0.012747 0.0341403 0.0954935 -0.0082886 0.1040521 -0.008934 -0.0142386 -0.0051711 -0.0115958 0.1226934 0.0170554 -0.087293 -0.0470116 -0.1034132 -0.0228178 -0.0499671 -0.0526124 -0.0466888 0.0988456 0.1094747 -0.0451074 -0.0175831 -0.0636994 0.0221281 -0.0406768 -0.0252242 -0.0368526 0.1489905 0.1735762 0.0781947 -0.0332691 0.1618982 0.2985296 0.009759 -0.0151754 -0.0049307 0.3960623 unknown
polarizability: 189.5392373|-6.6090557|123.851728|12.3641112|1.1677639|83.2352418 unknown
InChI: InChI=1S/C10H12ClNO2/c1-7(11)2-3-8-4-5-9(10(13)14)12-6-8/h4-7,13H,2-3H2,1H3
charge 0 multiplicity 1
26 atoms
Cl -4.726164 1.291622 -0.762343
O  4.337037 0.960396 0.612001
O  4.577502 -1.312772 0.188694
N  1.781356 -1.418297 -0.434979
C  -2.698487 -0.288394 0.391416
C  -1.853483 -0.29026 -0.911254
C  -4.213094 -0.324412 0.154557
C  -0.366217 -0.230973 -0.62452
C  -5.044909 -0.414842 1.433879
C  0.271818 0.974582 -0.235485
C  0.450984 -1.392447 -0.709047
C  1.651892 0.975832 0.050762
C  2.370309 -0.24259 -0.056186
C  3.839361 -0.309414 0.240945
H  -2.448576 0.598084 1.004767
H  -2.436149 -1.179675 0.998911
H  -2.161419 0.578445 -1.523014
H  -2.089249 -1.200984 -1.495249
H  -4.491061 -1.10742 -0.571387
H  -6.124221 -0.388914 1.211461
H  -4.809152 0.419963 2.116337
H  -4.820672 -1.365107 1.956743
H  -0.305767 1.903791 -0.167523
H  0.012086 -2.350219 -1.017319
H  2.177118 1.886119 0.34754
H  5.309856 0.873088 0.799193
