program: Gaussian 09
title: 000206354
version: EM64L-G09RevD.01
frameworkgroup: C1[X(C9H10N2O3)]
method: RPBEPBE
basis: SDD
operation: Freq
keyword: #p
keyword: freq=noraman
keyword: PBEPBE/SDD
title: #p freq=noraman PBEPBE/SDD
converged: YES YES NO YES
title: Mulliken charges:
elementType: O O O N N C C C C C C C C C H H H H H H H H H H
charge: -0.318019 -0.210425 -0.223142 -0.445423 -0.650258 0.470721 -0.426671 -0.383235 -0.383255 -0.224405 -0.224404 -0.230972 0.340478 0.282929 0.236813 0.236798 0.235772 0.235771 0.229517 0.229515 0.231644 0.328385 0.310804 0.351062
chargesum: 0.00000
title: Mulliken charges with hydrogens summed into heavy atoms:
elementType: O O O N N C C C C C C C C C
charge: -0.318019 -0.210425 -0.223142 -0.117039 0.011608 0.470721 0.046940 -0.147463 -0.147484 0.005112 0.005111 0.000672 0.340478 0.282929
polarizability: 1.69055087e+02 -1.58097228e+01 9.80909385e+01 3.41122828e-03 -2.09755164e-03 9.64131335e+01
1716.lowfreq: -18.6417 -11.6731 -5.0071 -1.7429 -0.0011 -0.0008 -0.0006 10.7845 20.7930
frequency: -17.8991 -10.9666 19.7714 52.9117 79.0422 132.8891 159.5553 223.8986 235.7158 320.6055 336.8671 365.9251 398.6683 403.6395 496.5487 528.6438 556.8939 580.8951 617.6655 634.1094 695.2083 700.1088 721.3198 732.9785 760.6207 836.6501 854.5053 866.7077 904.7361 934.7377 949.1237 978.3513 990.9136 997.8069 1011.2237 1027.5754 1056.5457 1088.7928 1146.1420 1173.4634 1187.9190 1191.6740 1228.1379 1303.0425 1325.7053 1351.2366 1386.3684 1440.6444 1465.8617 1476.8411 1488.1198 1596.6833 1612.3725 1617.6851 1668.5204 1721.2167 3013.6328 3077.5450 3122.6637 3124.7386 3136.6834 3149.6893 3165.5559 3532.3437 3541.7964 3693.2976
redmass: 5.0629 4.9628 5.2402 5.4449 4.4635 6.5936 5.3066 5.5740 9.2380 2.1903 1.2052 4.8891 5.5647 2.7964 3.9811 1.1425 4.3337 4.3799 6.3319 1.2361 7.0238 2.1692 3.3224 9.5581 2.2733 3.7310 1.2466 5.2490 3.3099 1.7723 1.6177 1.3926 6.2824 1.3265 9.1473 2.2083 2.0290 1.5121 2.6828 1.0538 1.1166 1.0902 2.3612 2.8208 1.2742 1.5012 8.7907 2.1970 2.0904 1.1433 2.4135 6.1487 1.2007 6.1730 4.9643 9.7230 1.0577 1.1080 1.0853 1.0884 1.0920 1.0963 1.1017 1.0631 1.0590 1.1041
irintensity: 3.7358 5.0680 7.6874 2.2163 1.6156 8.4263 2.0596 0.6099 3.1380 0.0616 48.9762 0.7872 1.6839 0.0017 24.2635 260.7614 7.4211 4.7715 0.0788 84.4009 7.6873 40.2615 45.7127 86.1926 62.1412 14.2494 0.0463 70.9904 35.7892 20.0334 1.9144 0.0011 5.1983 3.5162 443.8951 2.9318 7.1916 7.4183 391.4958 0.0029 0.4997 1.0386 9.4387 79.3745 0.2302 62.3604 0.3939 9.4279 844.6637 63.5800 16.9795 0.6726 51.4037 0.0327 13.5682 541.6092 20.1208 12.4907 4.5525 2.2031 14.2757 39.1213 19.4778 21.0319 48.0903 40.5712
temp: 298.150 k
press: 1.00000 atm
elementType: 8 8 8 7 7 6 6 6 6 6 6 6 6 6 1 1 1 1 1 1 1 1 1 1
symmnumber: 1
zpe: 479653.1 jmol-1
zpe.correction: 0.182690 hartree
zpe.thermalcorrener: 0.194433 hartree
zpe.thermalcorrenthalpy: 0.195378 hartree
zpe.thermalcorrgfe: 0.142891 hartree
zpe.sumelectzpe: -683.133953 hartree
zpe.sumelectthermal: -683.122210 hartree
zpe.sumelectthermalent: -683.121265 hartree
zpe.sumelectthermalfe: -683.173752 hartree
dipole: -3.0030 5.7698 -0.0013
dipole: 6.5046
quadrupole: -80.5261 -78.6970 -75.6098
quadrupole: 21.3896 -0.0047 0.0001
quadrupole: -2.2485 -0.4193 2.6678 21.3896 -0.0047 0.0001
hfenergy: -683.316643 hartree
pointgroup: C01 [X(C9H10N2O3)]
dipole: 1.2063537 -2.2569114 -0.0032841 debye
dipolederiv: -2.2075094 -0.0009081 0.0001855 0.0383021 -0.4772984 -0.0002695 0.0003972 -0.0002503 -0.2801582 -0.7033002 0.0348253 0.0000994 0.100706 -0.9672139 -0.0009248 0.0001841 -0.0008605 -0.3024236 -0.9295064 0.1974293 0.000365 0.2591653 -0.7970102 -0.0006964 0.0004028 -0.0006217 -0.3515454 -2.0627833 -0.5883406 -0.0006129 -0.698702 -0.7513763 -0.0004051 -0.0006669 -0.0004232 -0.3752788 -0.6504158 -0.4294486 -0.0006107 -0.5332029 -1.0538674 -0.0002845 -0.0007562 -0.0003128 -0.7757926 0.0448537 -0.0409133 -0.0000535 0.0587415 -0.0994632 -0.0000683 0.0000635 -0.0000715 -0.0179638 1.1909422 0.0122658 -0.0000106 0.3598012 0.3786796 -0.0000023 0.0004851 0.0000014 0.3068561 -0.0748295 -0.0463935 -0.0838776 -0.0363911 -0.1219363 0.0331684 -0.0153714 0.0213335 0.0469087 -0.0748647 -0.0465899 0.0837507 -0.0364689 -0.1217979 -0.0335751 0.0152371 -0.0217406 0.0468211 -0.0719261 -0.0435611 0.0934961 -0.0495039 -0.1224751 -0.0459031 0.1060268 -0.0403728 0.0737007 -0.0718841 -0.0433535 -0.0936385 -0.0492522 -0.1226788 0.0454223 -0.1061928 0.039905 0.0738488 0.0369424 -0.1147427 -0.0001207 -0.0967481 -0.0988977 -0.0000767 -0.0000956 -0.0000782 -0.0442862 2.572621 0.2316732 0.0000219 0.3183741 1.6287088 0.0017102 -0.0000249 0.0017048 0.3330189 2.409622 0.4542546 0.0003536 0.0914426 1.64431 0.0018154 -0.0001316 0.001733 0.3627581 -0.0477656 0.0118845 0.0137379 -0.0973809 0.0133214 -0.0449456 0.0177853 -0.1049232 -0.0490977 -0.0478326 0.011879 -0.0136922 -0.0973223 0.0129668 0.0451192 -0.0180164 0.1050981 -0.0488138 0.0694757 0.0540007 0.0911657 0.0525062 0.1167853 -0.0473739 0.0837989 -0.0351678 -0.0442257 0.0695148 0.0542059 -0.0910174 0.0526873 0.1165972 0.0477666 -0.083643 0.0355601 -0.0440805 0.0463586 0.0516669 -0.0788286 0.0600032 0.1311589 0.038339 -0.0947391 0.0418354 -0.0692331 0.0463116 0.0514924 0.078986 0.0597938 0.1313461 -0.0378539 0.0949123 -0.0413522 -0.0693793 -0.0754121 0.1148601 0.0001152 0.121691 0.1014342 0.0000313 0.0001221 0.000031 0.0879647 0.1617683 -0.0104855 0.0000178 0.0403146 0.1287748 -0.0002832 0.0000849 -0.0002861 0.3329509 0.154409 0.0478275 0.000099 0.0679261 0.145248 -0.0003923 0.0001173 -0.0004122 0.4062065 0.2152105 0.0364717 0.0000688 0.0135172 0.1846842 -0.0003178 0.0000203 -0.0003292 0.4012442 unknown
polarizability: 169.3938941|-15.0262709|97.7521229|-0.0243877|0.0042453|96.4131421 unknown
InChI: InChI=1S/C9H10N2O3/c10-8(12)11-9(13)14-6-7-4-2-1-3-5-7/h1-5,11H,6,10H2
charge 0 multiplicity 1
24 atoms
O  -0.433034 0.08725 -0.000007
O  -2.075553 1.779907 0.002562
O  -4.730423 0.475124 0.001224
N  -2.588751 -0.554956 -0.000474
N  -4.540542 -1.846142 -0.002035
C  1.96391 0.470335 0.000496
C  0.621234 1.157464 0.001154
C  2.604242 0.141576 1.221995
C  2.604565 0.144433 -1.221597
C  3.859978 -0.505341 1.223509
C  3.860306 -0.502475 -1.22428
C  4.490607 -0.828783 -0.000682
C  -1.761178 0.576571 0.000957
C  -4.015302 -0.554392 -0.000233
H  0.46618 1.7838 0.897472
H  0.466252 1.785689 -0.893852
H  2.116917 0.393641 2.171649
H  2.117494 0.398716 -2.17079
H  4.347172 -0.752233 2.173224
H  4.347759 -0.747139 -2.17444
H  5.466912 -1.326367 -0.001137
H  -2.081383 -1.442947 -0.001782
H  -3.98273 -2.697697 -0.003365
H  -5.554932 -1.922632 -0.002065
