program: Gaussian 09
title: 000206328
version: EM64L-G09RevD.01
frameworkgroup: C1[X(C16H10F4N2S)]
method: RPBEPBE
basis: SDD
operation: Freq
keyword: #p
keyword: freq=noraman
keyword: PBEPBE/SDD
title: #p freq=noraman PBEPBE/SDD
converged: YES YES NO NO
title: Mulliken charges:
elementType: S F F F F N N C C C C C C C C C C C C C C C C H H H H H H H H H H
charge: 0.048284 -0.192960 -0.160780 -0.166336 -0.160308 -0.257548 -0.035355 0.440968 0.431418 0.109273 -0.485054 0.083264 -0.429580 0.319251 -0.317806 -0.306872 -0.768343 -0.518010 -0.355229 -0.189531 -0.387349 0.368935 0.249585 0.288140 0.265351 0.276950 0.257211 0.274073 0.250965 0.290020 0.269111 0.244335 0.263928
chargesum: 0.00000
title: Mulliken charges with hydrogens summed into heavy atoms:
elementType: S F F F F N N C C C C C C C C C C C C C C C C
charge: 0.048284 -0.192960 -0.160780 -0.166336 -0.160308 -0.257548 -0.035355 0.440968 0.431418 0.109273 -0.485054 0.083264 -0.141440 0.319251 -0.052455 -0.029922 0.013906 -0.227991 -0.086118 0.054804 -0.123421 0.368935 0.249585
polarizability: 3.16668731e+02 5.99759527e+00 1.90007329e+02 -3.01190750e+01 -3.99291809e+00 1.38143973e+02
1716.lowfreq: -3.6457 -1.5231 0.0014 0.0015 0.0016 5.9220 12.5632 20.9668 23.7606
frequency: 12.4044 20.8916 23.7185 66.0994 78.4730 91.8057 109.2982 125.3179 178.9683 188.2792 196.5250 211.7491 251.2524 276.6010 284.4113 297.7276 308.1821 324.1660 350.3388 359.8871 423.6668 431.6353 435.3337 448.4606 460.1966 476.6721 503.5579 526.2713 544.0723 580.2585 605.7456 614.0101 620.5893 647.3285 661.1419 667.7634 696.3796 717.3624 757.3587 766.6193 804.1283 837.8001 838.2379 879.9295 895.6808 921.5583 934.8073 964.4249 980.2030 983.1777 989.3482 994.1104 1004.7576 1017.8975 1029.9736 1046.4469 1059.2455 1102.9010 1108.6358 1132.7267 1177.8085 1185.4440 1223.0144 1234.4800 1254.7316 1260.7119 1290.9471 1304.4705 1317.8957 1387.0486 1394.5308 1400.1804 1431.7713 1439.7501 1449.9189 1465.2901 1466.7384 1478.1703 1555.2007 1574.7519 1600.6351 1618.7304 1619.6077 2998.8219 3077.6967 3135.8722 3150.2028 3153.0700 3164.3232 3168.1937 3179.7654 3182.4487 3191.3358
redmass: 16.6904 8.4215 10.0350 5.3813 6.8491 6.9878 4.2826 6.6520 1.1506 6.6835 11.9986 6.7276 6.7949 5.8945 3.9174 4.9609 6.2647 8.7551 8.5925 9.1073 4.7072 4.8319 7.6573 6.2024 4.2948 5.2574 7.8499 8.7926 5.1082 3.7228 10.4337 9.9411 7.0231 6.6816 5.5507 5.1965 2.3225 6.6206 7.7959 3.3374 1.6708 4.1332 1.5969 1.5825 4.8911 1.4997 1.3982 4.3024 1.3294 8.0327 5.5396 1.4325 3.6684 4.0840 2.5890 1.5465 2.6939 1.7884 1.6291 2.4591 2.1598 1.1506 3.0648 2.9753 4.9489 2.1461 2.5320 1.7054 5.3487 9.3360 3.0319 1.7334 3.7293 3.7963 1.2222 1.0863 2.7559 2.5942 7.4385 7.7762 6.6496 6.9143 6.8759 1.0384 1.0970 1.0988 1.0877 1.0902 1.0932 1.0934 1.0996 1.0960 1.0938
irintensity: 0.1776 0.5325 0.1380 0.5755 3.6602 0.4159 0.8139 0.2845 0.4054 0.1522 3.2718 0.4785 2.3473 2.1861 1.2699 0.0859 4.9539 6.3131 3.0110 5.7776 3.3304 3.3565 0.8909 0.6172 1.8222 3.4361 14.2642 1.0513 4.5658 3.7803 12.1019 3.2548 3.4901 9.0297 8.3628 2.7925 18.1277 9.9816 40.1345 2.9763 42.8618 21.9822 41.0679 38.6190 35.5177 23.9361 14.4156 14.7666 0.6848 170.5259 4.2079 7.7134 49.5993 122.6868 46.6522 3.9061 68.8121 15.4522 19.9095 61.5091 26.0414 3.0314 132.6201 125.5439 38.2301 30.2790 99.7183 74.3741 264.2877 3.2216 42.8279 31.3492 41.3265 44.9308 59.3770 32.4805 68.3128 14.3896 85.8099 295.5279 1.8482 39.4683 32.8405 9.9305 6.5946 6.9228 4.7029 1.9936 1.6010 1.7158 5.1899 3.1073 1.2909
temp: 298.150 k
press: 1.00000 atm
elementType: 16 9 9 9 9 7 7 6 6 6 6 6 6 6 6 6 6 6 6 6 6 6 6 1 1 1 1 1 1 1 1 1 1
symmnumber: 1
zpe: 588563.1 jmol-1
zpe.correction: 0.224172 hartree
zpe.thermalcorrener: 0.243738 hartree
zpe.thermalcorrenthalpy: 0.244682 hartree
zpe.thermalcorrgfe: 0.173276 hartree
zpe.sumelectzpe: -1521.060356 hartree
zpe.sumelectthermal: -1521.040790 hartree
zpe.sumelectthermalent: -1521.039846 hartree
zpe.sumelectthermalfe: -1521.111252 hartree
dipole: -0.2192 2.0377 3.3293
dipole: 3.9095
quadrupole: -154.4897 -140.7127 -132.6563
quadrupole: -7.3922 -12.1109 2.6470
quadrupole: -11.8701 1.9069 9.9633 -7.3922 -12.1109 2.6470
hfenergy: -1521.2845279 hartree
pointgroup: C01 [X(C16H10F4N2S1)]
dipole: 0.0968787 -1.1306918 1.0382673 debye
polarizability: 317.5078802|-2.7847613|184.0173917|28.1383189|16.9954605|143.2947613 unknown
InChI: InChI=1S/C16H10F4N2S/c1-9-21-14-8-11(17)5-6-13(14)15(23)22(9)12-4-2-3-10(7-12)16(18,19)20/h2-8H,1H3
charge 0 multiplicity 1
33 atoms
S  -0.387204 2.233173 1.16656
F  -6.536197 0.066167 -0.788263
F  5.612141 1.065033 -0.542456
F  4.880829 -0.690431 -1.772687
F  3.920388 1.343058 -2.034551
N  -0.273124 -0.376513 0.355137
N  -2.077242 -1.751057 -0.453554
C  1.146966 -0.298798 0.684132
C  -2.485822 0.610769 0.212315
C  -0.800311 -1.59651 -0.143105
C  -1.072139 0.784288 0.560897
C  -2.943675 -0.658442 -0.283922
C  2.069069 0.074276 -0.311475
C  3.44237 0.124021 0.013429
C  1.57612 -0.616304 1.990701
C  -3.418779 1.676728 0.357048
C  0.139932 -2.762725 -0.323575
C  -4.311135 -0.842345 -0.621565
C  3.890485 -0.190284 1.317674
C  2.950761 -0.557786 2.304359
C  -4.768752 1.5013 0.024989
C  -5.18136 0.235921 -0.458521
C  4.440752 0.464499 -1.05702
H  1.719638 0.346813 -1.311709
H  0.837496 -0.881246 2.753809
H  -3.048765 2.634994 0.734977
H  0.950476 -2.532421 -1.03758
H  -0.447733 -3.608398 -0.707341
H  0.620223 -3.055686 0.626931
H  -4.651989 -1.809481 -0.997661
H  4.956378 -0.135486 1.558002
H  3.289413 -0.792002 3.318062
H  -5.498306 2.308873 0.129764
