program: Gaussian 09
title: 000206325
version: EM64L-G09RevD.01
frameworkgroup: C1[X(C18H17FN2OS)]
method: RPBEPBE
basis: SDD
operation: Freq
keyword: #p
keyword: freq=noraman
keyword: PBEPBE/SDD
title: #p freq=noraman PBEPBE/SDD
converged: YES YES NO NO
title: Mulliken charges:
elementType: S F O N N C C C C C C C C C C C C C C C C C C H H H H H H H H H H H H H H H H H
charge: 0.040756 -0.200347 -0.262653 -0.256733 -0.021914 0.106124 0.403393 0.451876 -0.493235 -0.471677 0.020022 -0.312618 -0.322174 -0.489117 -0.316437 -0.684034 0.343755 -0.363147 -0.343089 0.339605 -0.362102 -0.247258 -0.683149 0.243962 0.242435 0.255932 0.250720 0.296499 0.267080 0.234188 0.226899 0.239772 0.255966 0.249525 0.262010 0.207889 0.214271 0.209627 0.235058 0.232319
chargesum: 0.00000
title: Mulliken charges with hydrogens summed into heavy atoms:
elementType: S F O N N C C C C C C C C C C C C C C C C C C
charge: 0.040756 -0.200347 -0.262653 -0.256733 -0.021914 0.106124 0.403393 0.451876 -0.493235 0.014720 0.020022 -0.056686 -0.071454 -0.192618 -0.049357 0.016826 0.343755 -0.107181 -0.093564 0.339605 -0.100092 0.174901 -0.006146
polarizability: 3.70782433e+02 1.14145438e+01 2.20669775e+02 -5.85657140e+00 -7.00535255e+00 1.45698956e+02
1716.lowfreq: -6.2114 0.0009 0.0010 0.0016 3.7026 6.1687 24.2777 28.3785 41.2317
frequency: 23.9748 28.3544 41.1506 56.6638 71.3472 77.8779 91.0999 122.3941 128.7763 167.2912 172.4652 182.2397 189.0836 200.2489 214.6933 244.9270 261.8611 294.1141 340.8180 352.0285 376.8915 386.1205 397.2837 418.0316 427.7002 434.1449 455.1930 491.2479 505.6494 545.9412 554.6370 562.9206 606.8426 629.4842 646.6529 657.0134 703.2039 706.9226 730.7040 776.1109 777.5802 784.6857 805.2621 827.5898 832.4672 835.4986 838.6602 869.7367 902.3505 912.2994 939.2641 939.9788 961.4916 963.5096 991.3574 997.9697 1021.1895 1035.7592 1058.7505 1070.3655 1110.3628 1112.4636 1118.3208 1136.3768 1142.0192 1158.8158 1175.9422 1213.9907 1219.7491 1230.1096 1252.6661 1260.9973 1265.6111 1284.1446 1295.5811 1314.3464 1321.9516 1362.9611 1376.2171 1384.1884 1399.1345 1400.7157 1421.1629 1425.3836 1461.1612 1461.1975 1464.8967 1475.9581 1476.6446 1484.2588 1486.2326 1499.8107 1547.0250 1566.9289 1585.1192 1619.0400 1621.1451 2958.1319 2990.1901 2998.4082 3017.8784 3031.6397 3083.1478 3090.4177 3095.8903 3107.3754 3107.7927 3147.2002 3149.2243 3162.5464 3164.6292 3171.3978 3174.8815 3184.3078
redmass: 7.8891 4.5707 3.5322 3.6674 4.1271 3.7754 4.3647 1.8529 4.3462 5.6801 4.5564 5.0987 7.1869 2.1599 1.9442 1.2314 4.8042 3.1408 5.2610 4.7752 5.4515 6.3564 5.3311 2.9888 4.7850 4.8669 6.7064 4.4506 3.2509 4.4995 3.9930 5.0061 4.4780 6.6550 6.7083 6.2302 5.1489 5.1526 3.9248 3.2655 3.5752 1.7335 1.3056 2.1917 1.1885 1.6551 1.8926 5.3716 3.3866 1.4780 1.8689 2.3204 1.3379 1.3442 3.1153 3.0748 2.5920 2.7859 1.9876 1.7017 1.5037 1.4741 1.8095 1.4418 2.5447 2.4904 1.2684 2.3274 2.8780 2.6399 5.4784 2.1814 1.1383 1.8360 1.2923 2.6212 1.7494 2.2144 2.0330 1.2164 9.7043 1.2997 3.9618 4.6133 1.0626 1.0749 3.3437 1.0527 1.1183 1.0839 1.2174 1.8815 8.3814 8.5615 7.6100 7.4455 6.6175 1.0555 1.0344 1.0362 1.1075 1.0602 1.1000 1.1001 1.0989 1.1031 1.1015 1.0894 1.0891 1.0922 1.0890 1.0954 1.0968 1.0983
irintensity: 0.6167 0.6446 0.1050 0.0841 0.9280 0.0770 0.2674 2.2600 0.4641 0.6544 1.3800 2.8122 0.6925 1.6638 0.9463 1.2895 2.9149 0.3161 3.1007 4.1147 2.5436 0.0898 2.2815 0.0723 0.9577 2.8794 0.1643 0.9625 6.2178 19.9202 5.9435 2.6079 28.2258 1.2001 3.1202 4.3322 12.7281 4.0454 11.9532 1.7205 2.4454 17.7123 12.3050 1.2796 10.8710 48.0968 25.4748 23.6462 33.2922 24.2568 14.6903 12.7259 0.7442 0.9412 4.0184 19.1957 4.1552 74.0158 17.0628 14.2366 14.2204 15.0573 12.0327 4.2038 27.0241 50.1732 103.1497 59.7711 205.1768 93.8291 151.9563 12.7233 0.0182 0.6268 0.8439 52.3478 32.9470 0.8187 14.4301 19.8496 18.9514 48.8199 1.5621 24.3981 7.4669 20.0780 291.1563 10.8516 43.9489 14.8761 58.1972 97.0892 58.1005 95.0555 13.0137 44.5930 48.1488 37.0514 31.9251 26.6314 31.3710 10.8145 7.0044 31.5080 27.6417 34.8109 31.3938 5.8228 11.7021 8.7441 2.5702 9.2974 2.0861 5.8594
temp: 298.150 k
press: 1.00000 atm
elementType: 16 9 8 7 7 6 6 6 6 6 6 6 6 6 6 6 6 6 6 6 6 6 6 1 1 1 1 1 1 1 1 1 1 1 1 1 1 1 1 1
symmnumber: 1
zpe: 809917.1 jmol-1
zpe.correction: 0.308481 hartree
zpe.thermalcorrener: 0.329587 hartree
zpe.thermalcorrenthalpy: 0.330531 hartree
zpe.thermalcorrgfe: 0.256987 hartree
zpe.sumelectzpe: -1377.118333 hartree
zpe.sumelectthermal: -1377.097227 hartree
zpe.sumelectthermalent: -1377.096283 hartree
zpe.sumelectthermalfe: -1377.169827 hartree
dipole: -4.3514 3.5170 -1.8180
dipole: 5.8830
quadrupole: -123.5024 -148.3077 -136.2882
quadrupole: 11.0225 7.6979 3.3313
quadrupole: 12.5303 -12.2749 -0.2554 11.0225 7.6979 3.3313
hfenergy: -1377.4268144 hartree
pointgroup: C01 [X(C18H17F1N2O1S1)]
dipole: 1.6868023 1.4399265 0.6621534 debye
polarizability: 371.1524845|-9.5139086|220.8473919|-3.8532871|3.3854165|145.1512873 unknown
InChI: InChI=1S/C18H17FN2OS/c1-3-17-20-16-10-5-12(19)11-15(16)18(23)21(17)13-6-8-14(9-7-13)22-4-2/h5-11H,3-4H2,1-2H3
charge 0 multiplicity 1
40 atoms
S  -0.472631 -2.378258 -0.29047
F  -5.834424 -2.27554 -0.073562
O  5.317757 -0.40067 -0.373807
N  -0.294681 0.340479 0.029357
N  -2.114061 1.895518 0.314984
C  -0.815659 1.646844 0.220264
C  1.152779 0.147407 -0.046652
C  -2.567449 -0.527177 0.015915
C  -1.127463 -0.809956 -0.07785
C  0.132577 2.828719 0.280382
C  -3.012278 0.824466 0.212066
C  1.803231 0.179883 -1.301372
C  1.889743 -0.085174 1.130583
C  -3.526882 -1.572299 -0.08003
C  -4.405032 1.106335 0.309907
C  0.307178 3.503387 -1.107414
C  3.942453 -0.228765 -0.188283
C  3.193857 -0.004179 -1.373088
C  3.287479 -0.270525 1.070256
C  -4.877913 -1.246351 0.0205
C  -5.348755 0.075222 0.214635
C  6.149624 -0.686076 0.815211
C  7.583763 -0.848507 0.320399
H  -0.322785 3.555671 0.974085
H  1.116201 2.534652 0.680136
H  1.21798 0.320401 -2.215684
H  1.369979 -0.138169 2.092841
H  -3.188429 -2.602041 -0.228832
H  -4.707486 2.146308 0.459739
H  0.801692 2.827292 -1.826501
H  0.930403 4.409857 -1.009962
H  -0.6746 3.797602 -1.51709
H  3.720849 0.009681 -2.331419
H  3.842636 -0.453829 1.994057
H  -6.423491 0.264898 0.285723
H  6.063985 0.154598 1.534252
H  5.783233 -1.611867 1.303948
H  8.25602 -1.061637 1.171195
H  7.655312 -1.681301 -0.399456
H  7.930986 0.072502 -0.177959
