program: Gaussian 09
title: 000206320
version: EM64L-G09RevD.01
frameworkgroup: C1[X(C15H10F2N2S)]
method: RPBEPBE
basis: SDD
operation: Freq
keyword: #p
keyword: freq=noraman
keyword: PBEPBE/SDD
title: #p freq=noraman PBEPBE/SDD
converged: NO NO NO NO
title: Mulliken charges:
elementType: S F F N N C C C C C C C C C C C C C C C H H H H H H H H H H
charge: 0.046999 -0.197082 -0.198095 -0.250837 -0.030778 0.457814 0.114006 -0.479868 0.010296 0.408257 -0.484505 -0.311807 -0.769212 -0.285619 -0.285993 0.340626 -0.359682 -0.350628 -0.350674 0.325317 0.296673 0.268375 0.252688 0.269841 0.252670 0.261494 0.261461 0.264046 0.262106 0.262110
chargesum: 0.00000
title: Mulliken charges with hydrogens summed into heavy atoms:
elementType: S F F N N C C C C C C C C C C C C C C C
charge: 0.046999 -0.197082 -0.198095 -0.250837 -0.030778 0.457814 0.114006 -0.479868 0.010296 0.408257 -0.187831 -0.043432 0.005987 -0.024126 -0.024532 0.340626 -0.095636 -0.088522 -0.088565 0.325317
polarizability: 3.00524815e+02 -1.40041758e+01 1.85871614e+02 -3.81027822e-03 3.46033727e-02 1.15199713e+02
1716.lowfreq: -8.7871 -0.0008 0.0005 0.0015 6.1640 8.2498 29.1314 41.8097 49.3990
frequency: 28.3792 41.6735 49.3803 73.6327 118.3871 151.9271 170.0994 172.9580 197.4080 214.0761 216.4722 287.7693 344.1538 349.9559 371.4223 380.9155 413.1556 415.2459 424.2047 448.1631 464.2492 499.1862 508.3518 555.3877 562.4385 605.4224 609.4841 628.6537 643.7449 670.5118 698.3431 729.8873 772.4642 794.8133 816.6884 823.8583 837.7513 838.8376 884.7360 915.5245 945.2379 952.9206 960.1629 963.6957 1001.1863 1010.9300 1026.4325 1045.2024 1101.0711 1112.5076 1145.3171 1154.5254 1166.2413 1194.0948 1230.2416 1245.5280 1256.1001 1267.9406 1284.8057 1310.1945 1373.7293 1397.4494 1399.4710 1405.7376 1428.2101 1451.6260 1461.8890 1465.6517 1489.5129 1557.1043 1574.1367 1603.5703 1611.3588 1620.8530 2998.6637 3077.7328 3135.2353 3155.7985 3156.5907 3161.0562 3164.3776 3177.8056 3180.7622 3183.7817
redmass: 10.1786 3.9889 10.6710 4.9957 4.9952 4.8210 1.2681 8.8727 16.4363 6.7432 3.5252 4.6117 8.0550 8.3839 5.8314 5.3459 4.5846 3.0661 6.6832 7.8768 3.7124 3.4657 7.3939 4.1460 4.3190 4.8830 5.6156 6.9265 7.1347 5.2714 5.3235 5.2264 3.5028 6.7280 1.2425 2.2595 1.6279 2.8453 6.1513 1.4679 1.4684 4.0984 1.3529 1.3387 3.1725 2.0999 2.1836 1.5415 1.2735 1.4814 2.4848 1.3508 3.0067 2.4266 2.5827 4.2458 6.9903 2.3962 1.2578 5.6304 7.8796 1.5244 4.0664 3.6403 4.3607 1.1404 1.0471 3.4915 2.7701 7.2142 7.6951 8.1274 6.5456 7.5239 1.0381 1.0970 1.0991 1.0901 1.0896 1.0925 1.0888 1.0969 1.0979 1.0983
irintensity: 0.1408 0.0135 0.1501 0.3926 0.1746 1.7718 1.4003 1.4970 1.3274 0.5607 4.9141 0.9081 7.6299 2.9053 1.3812 0.1105 0.1253 0.0521 2.6476 0.5290 3.1360 7.3333 16.7165 4.8802 11.7693 26.2353 0.1727 1.0777 0.6274 0.7376 9.7795 24.6628 1.0340 15.7957 0.0651 17.0194 49.4218 37.8036 19.7155 24.7387 0.7203 13.9956 0.1659 0.8251 25.9139 3.3899 3.3602 3.1321 13.2616 19.5177 41.8879 42.1971 52.7228 53.2211 70.2695 29.1063 69.1781 49.6696 1.0155 116.4937 1.2939 18.4502 38.6225 1.7913 18.8734 29.1692 23.5138 265.7497 144.3872 4.1650 136.8770 3.1707 22.7989 33.7122 11.3991 7.1988 7.9644 0.7079 7.2928 8.7642 1.6477 1.0621 0.5501 4.7700
temp: 298.150 k
press: 1.00000 atm
elementType: 16 9 9 7 7 6 6 6 6 6 6 6 6 6 6 6 6 6 6 6 1 1 1 1 1 1 1 1 1 1
symmnumber: 1
zpe: 558274.2 jmol-1
zpe.correction: 0.212635 hartree
zpe.thermalcorrener: 0.229135 hartree
zpe.thermalcorrenthalpy: 0.230079 hartree
zpe.thermalcorrgfe: 0.167411 hartree
zpe.sumelectzpe: -1283.484872 hartree
zpe.sumelectthermal: -1283.468372 hartree
zpe.sumelectthermalent: -1283.467428 hartree
zpe.sumelectthermalfe: -1283.530096 hartree
dipole: 1.0156 4.0638 -0.0014
dipole: 4.1887
quadrupole: -128.3752 -128.1404 -113.8009
quadrupole: -2.4701 -0.0035 0.0200
quadrupole: -4.9364 -4.7015 9.6379 -2.4701 -0.0035 0.0200
hfenergy: -1283.6975069 hartree
pointgroup: C01 [X(C15H10F2N2S1)]
dipole: 0.388726 1.6014525 -0.0083556 debye
polarizability: 300.7083569|-13.2286344|185.6865474|-0.2975582|-0.2507965|115.2012377 unknown
InChI: InChI=1S/C15H10F2N2S/c1-9-18-14-7-4-11(17)8-13(14)15(20)19(9)12-5-2-10(16)3-6-12/h2-8H,1H3
charge 0 multiplicity 1
30 atoms
S  0.035431 -2.381034 0.005188
F  -5.309527 -1.850767 0.013387
F  5.944758 -0.749583 -0.012649
N  0.406328 0.335949 -0.008369
N  -1.285208 2.05107 -0.012883
C  -1.921422 -0.352918 -0.00043
C  -0.01136 1.694073 -0.01394
C  -0.506362 -0.754244 -0.001556
C  -2.26247 1.042658 -0.006038
C  1.835591 0.038824 -0.009402
C  -2.955524 -1.326544 0.006127
C  -3.630029 1.437447 -0.00481
C  1.050204 2.766862 -0.021326
C  2.516533 -0.10196 -1.238372
C  2.521383 -0.086811 1.218511
C  -4.280288 -0.891887 0.007009
C  -4.649248 0.475494 0.001711
C  3.901283 -0.368257 -1.247043
C  3.906168 -0.353062 1.225005
C  4.563113 -0.48661 -0.011535
H  -2.695468 -2.389632 0.010282
H  -3.854375 2.507498 -0.009155
H  1.705276 2.703917 0.865617
H  0.5370 3.738742 -0.026568
H  1.703789 2.693293 -0.908529
H  1.963644 -0.025442 -2.179721
H  1.972258 0.001286 2.161065
H  -5.707315 0.753418 0.002729
H  4.456841 -0.489535 -2.181347
H  4.465394 -0.462845 2.158542
