program: Gaussian 09
title: 000206247
version: EM64L-G09RevD.01
frameworkgroup: C1[X(C8H14N4)]
method: RPBEPBE
basis: SDD
operation: Freq
keyword: #pfreq=noraman
keyword: PBEPBE/SDD
title: #p freq=noraman PBEPBE/SDD
converged: YES YES NO NO
title: Mulliken charges:
elementType: N N N N C C C C C C C C H H H H H H H H H H H H H H
charge: -0.209902 -0.142734 -0.052368 -0.102276 -0.074462 -0.436084 -0.439841 -0.392513 -0.397598 -0.388763 0.215783 -0.630684 0.210984 0.202102 0.231378 0.237645 0.207630 0.188983 0.208438 0.208074 0.189623 0.199883 0.203655 0.244649 0.244623 0.273775
chargesum: 0.00000
title: Mulliken charges with hydrogens summed into heavy atoms:
elementType: N N N N C C C C C C C C
charge: -0.209902 -0.142734 -0.052368 -0.102276 0.136522 -0.002603 0.005433 0.004908 0.000098 0.014775 0.215783 0.132364
polarizability: 1.32408889e+02 7.80474404e-01 1.03041561e+02 1.09187764e+00 4.25849587e+00 8.60301468e+01
1716.lowfreq: -16.8065 -8.4033 0.0001 0.0006 0.0009 5.0106 8.0787 85.1522 89.5490
frequency: -14.0560 85.1265 89.5320 105.9352 193.2036 218.4326 225.9497 256.7900 328.3812 362.8764 388.1657 431.6774 482.5888 493.6645 657.6475 663.8096 727.0609 758.0595 785.8599 812.9867 854.8430 879.5556 888.7509 894.1693 921.1195 928.8912 989.5471 1017.2441 1047.0911 1052.0466 1070.7989 1104.9975 1112.9164 1115.8119 1125.7477 1165.0623 1182.3249 1208.0399 1244.5076 1254.2374 1264.8811 1294.6297 1304.2270 1319.1281 1336.6704 1342.4257 1345.3421 1355.0872 1390.7494 1428.8431 1462.0601 1464.7345 1466.5863 1468.6223 1472.2585 1475.1748 1479.3854 1490.8217 2961.6776 2964.5966 2965.5354 2974.4433 2982.5813 2992.8016 3003.6476 3030.7051 3033.9929 3040.1172 3047.7104 3058.5110 3092.7843 3134.6217
redmass: 3.4888 2.8538 1.2255 3.3190 2.7397 3.0700 2.0582 4.5027 1.9721 4.7390 2.8434 3.1801 3.0820 1.6167 4.9583 9.4800 9.0000 2.7019 1.4448 3.7396 1.7899 2.6861 1.5592 3.6093 1.9043 4.8613 2.9733 6.0120 1.4029 1.7715 1.2938 3.2824 2.5162 2.8437 1.3255 2.7442 1.4843 2.5637 1.4918 1.3213 1.2894 1.2209 1.5452 1.3452 1.3704 1.4744 1.6057 1.6283 2.5038 1.6005 1.1031 1.0871 1.0990 1.4098 1.0919 1.0423 1.0890 1.9168 1.0814 1.0644 1.0645 1.0617 1.0612 1.0620 1.0348 1.0971 1.0943 1.1029 1.1033 1.1026 1.1026 1.0999
irintensity: 2.4977 3.2332 0.8739 2.1000 1.4894 0.1125 0.1938 0.6000 0.7319 0.2835 0.1466 0.0603 0.4683 1.5858 5.5431 1.1351 0.9661 2.4153 0.0855 1.0476 7.9818 5.2759 12.5866 5.4786 0.5159 20.0566 3.2222 24.1686 0.1134 0.1243 0.1580 4.4696 0.2223 1.6425 0.3697 4.6260 1.0482 4.0808 1.9377 0.6895 0.7678 1.2716 4.3145 0.2055 0.2858 0.4669 3.0333 2.1170 10.6267 13.5102 3.2710 7.2145 7.7185 8.8331 18.9174 26.1698 5.4930 49.7186 11.6841 23.2558 50.0047 30.8202 31.9293 21.2197 26.2558 71.7382 55.1388 16.9546 29.2994 71.8783 16.3423 2.8253
temp: 298.150 k
press: 1.00000 atm
elementType: 7 7 7 7 6 6 6 6 6 6 6 6 1 1 1 1 1 1 1 1 1 1 1 1 1 1
symmnumber: 1
zpe: 577621.7 jmol-1
zpe.correction: 0.220004 hartree
zpe.thermalcorrener: 0.230401 hartree
zpe.thermalcorrenthalpy: 0.231345 hartree
zpe.thermalcorrgfe: 0.183887 hartree
zpe.sumelectzpe: -531.279094 hartree
zpe.sumelectthermal: -531.268698 hartree
zpe.sumelectthermalent: -531.267753 hartree
zpe.sumelectthermalfe: -531.315212 hartree
dipole: 3.7189 5.3065 1.9319
dipole: 6.7617
quadrupole: -83.3383 -74.2889 -71.3840
quadrupole: -12.2090 -4.7274 -1.0316
quadrupole: -7.0013 2.0482 4.9531 -12.2090 -4.7274 -1.0316
hfenergy: -531.4990986 hartree
pointgroup: C01 [X(C8H14N4)]
dipole: 1.5580485 1.7891992 1.2034413 debye
dipolederiv: -0.1978573 -0.1319067 -0.1027986 -0.0588625 -0.410058 -0.2394589 -0.0420987 -0.2329283 -0.1998367 -0.5179397 0.0090282 -0.0170632 -0.1937627 -0.2623719 -0.0551706 -0.1440233 -0.048157 -0.2258177 -0.2644853 0.2833324 0.1797387 0.2634718 0.0377042 0.128319 0.158215 0.1112028 -0.0204921 0.1764696 0.0049118 0.043498 -0.0365033 -0.1762767 -0.0096298 -0.0045146 0.0044776 -0.1782596 -0.0773468 -0.0145695 -0.0029342 -0.0034107 0.0949479 0.0733038 0.086633 0.0788765 0.1212865 -0.0024448 -0.0097629 -0.0250333 0.0304644 0.1054927 0.0141768 -0.1602164 -0.0224075 0.0942775 0.0261663 -0.0216607 -0.0016217 -0.1207913 0.0808005 -0.0248699 0.0261526 0.0071136 0.0989409 0.0480926 0.0113042 -0.013161 0.0025159 0.1033549 0.0455324 0.0816854 0.0791605 0.1037916 0.0440328 -0.0133594 0.008212 0.0614943 0.1084217 0.0789466 0.0069297 0.0476597 0.1075247 0.0746131 0.0170117 0.0185134 -0.0197522 0.0882594 0.0478069 -0.0154106 0.0474636 0.0875779 0.5446026 -0.1162476 -0.0759147 0.1182176 0.1981807 0.1033683 0.063624 0.0940743 0.087369 0.080791 -0.0055426 -0.0130446 -0.0306888 0.3614948 0.0989756 -0.0311644 0.0920751 0.2736637 0.034358 -0.0000599 -0.0003155 0.0080865 -0.0669043 -0.0968448 -0.0045359 -0.0950679 -0.0652431 -0.0294116 0.1107502 -0.0487888 0.1042257 -0.0999627 0.1010361 -0.0316339 0.0626116 0.0272764 0.0549921 -0.02994 0.0051928 -0.0337067 -0.020523 -0.1202282 -0.0070967 -0.0622798 -0.0209192 0.0670313 0.0023396 -0.0228096 -0.0018531 -0.0083461 -0.061732 -0.0293218 -0.1108129 -0.0127999 -0.0131133 -0.0441401 0.1032545 -0.0243474 0.0292077 0.0685769 0.0939883 0.0972635 -0.0983328 0.0280534 0.0231324 -0.0129207 -0.0049514 -0.0852585 -0.1002895 -0.057507 -0.1624455 -0.0448611 -0.0483328 -0.0502014 0.0874891 -0.0485142 0.0230123 0.0864134 0.1016041 0.1140706 -0.1120626 -0.0481582 0.0928742 -0.0523227 0.1121006 -0.1077082 0.1103499 -0.0456697 0.0813382 0.0260479 0.0298119 -0.0129882 0.0223121 -0.0627769 -0.0455534 -0.1633438 -0.0055524 -0.099342 -0.0874982 0.0956677 -0.0221604 -0.0234364 0.0307181 -0.079343 -0.1019253 0.0279834 -0.1002867 -0.0826859 -0.2405473 -0.0330881 -0.0268613 -0.0597391 0.0516287 0.0132132 -0.0538788 0.012154 0.0540665 0.0964761 -0.0054631 -0.1101875 0.0311184 0.0197008 0.0288896 -0.0605192 -0.031949 -0.0765042 0.0722999 -0.1205823 0.0472998 -0.0578828 -0.0451285 -0.0033273 0.0660446 0.0511059 0.0142125 -0.0338215 0.0769883 0.0337034 -0.0048703 0.1052279 -0.0220881 -0.0197163 -0.0149709 0.129278 unknown
polarizability: 132.4117672|-0.9107391|100.2805118|1.2107769|7.5406297|88.7883176 unknown
InChI: InChI=1S/C8H14N4/c1-12-8(9-10-11-12)7-5-3-2-4-6-7/h7H,2-6H2,1H3
charge 0 multiplicity 1
26 atoms
N  -1.954266 0.657856 0.306712
N  -1.321669 -1.16935 -0.787687
N  -3.135985 0.048191 -0.175325
N  -2.727907 -1.052656 -0.833288
C  0.574516 0.213346 0.207662
C  1.277228 0.766375 -1.071781
C  1.320081 -1.045905 0.737201
C  2.772042 1.06026 -0.807989
C  2.814758 -0.746659 0.992363
C  3.507697 -0.19198 -0.274409
C  -0.868426 -0.098003 -0.076227
C  -2.036312 1.893745 1.086323
H  0.623411 0.999566 0.99116
H  0.759961 1.680901 -1.422607
H  1.176011 0.010341 -1.874361
H  1.212404 -1.853425 -0.011353
H  0.834508 -1.404519 1.66498
H  2.863341 1.8823 -0.067315
H  3.248034 1.417803 -1.741095
H  3.322724 -1.668927 1.333276
H  2.910927 -0.00725 1.815121
H  3.509766 -0.974549 -1.060385
H  4.565574 0.050751 -0.057312
H  -1.629338 1.7468 2.101323
H  -1.486933 2.710569 0.588517
H  -3.098946 2.16682 1.160998
