program: Gaussian 09
title: 000206234
version: EM64L-G09RevD.01
frameworkgroup: C1[X(C24H25N3OS)]
method: RPBEPBE
basis: SDD
operation: Freq
keyword: #p
keyword: freq=noraman
keyword: PBEPBE/SDD
title: #p freq=noraman PBEPBE/SDD
converged: YES YES NO NO
title: Mulliken charges:
elementType: S O N N N C C C C C C C C C C C C C C C C C C C C C C C C H H H H H H H H H H H H H H H H H H H H H H H H H
charge: 0.155478 -0.303108 -0.098183 -0.060000 -0.040630 -0.172962 -0.355168 -0.342419 -0.396287 -0.401421 -0.634693 0.632452 0.631203 -0.400141 -0.614408 -0.573276 -0.322770 -0.431085 -0.236340 0.384225 -0.279188 -0.422361 -0.250837 -0.245003 0.152918 -0.334776 -0.151903 -0.321549 -0.194811 0.200278 0.184222 0.225415 0.229265 0.188124 0.195301 0.202070 0.203467 0.193994 0.227684 0.249452 0.220945 0.220242 0.187333 0.274329 0.228321 0.253970 0.243960 0.259246 0.228025 0.229491 0.261938 0.242540 0.243942 0.233488
chargesum: 0.00000
title: Mulliken charges with hydrogens summed into heavy atoms:
elementType: S O N N N C C C C C C C C C C C C C C C C C C C C C C C C
charge: 0.155478 -0.303108 -0.098183 -0.060000 -0.040630 0.027316 0.054469 0.074970 0.001083 -0.003960 -0.157557 0.632452 0.631203 -0.400141 0.014112 -0.298947 -0.322770 -0.202764 0.017630 0.384225 -0.035229 -0.163115 -0.022812 -0.015512 0.152918 -0.072838 0.090637 -0.077607 0.038677
polarizability: 4.46836164e+02 2.15394335e+01 2.56023084e+02 -8.26733717e-01 2.60308006e+01 2.28377842e+02
1716.lowfreq: -10.3994 -0.0011 -0.0006 0.0014 3.4570 6.3396 14.0828 22.0173 25.5910
frequency: 10.7010 22.0079 25.0557 33.0203 46.2186 54.7170 73.4875 87.4284 99.7398 121.7184 157.4142 186.3867 193.8657 202.1341 220.9355 223.6114 234.2246 239.9977 266.2542 279.5151 291.9608 318.5526 323.6802 341.2345 351.7291 380.6862 402.0057 408.4632 412.4227 439.4993 446.6553 452.3761 486.7879 490.5061 504.6579 506.1144 544.4038 558.4168 597.5186 606.4269 624.3300 636.6893 647.6451 659.8850 678.5142 709.6174 732.7309 735.8159 742.6193 755.3601 757.3744 768.2535 776.6827 822.9890 831.3699 845.9775 847.4730 865.6189 879.4585 892.5422 907.5489 931.8208 938.4825 950.0297 953.6586 954.9217 956.9956 978.1052 991.1225 1003.5826 1010.3666 1027.5376 1032.6519 1036.0813 1043.1765 1048.5463 1061.4164 1078.8171 1079.3261 1089.5807 1115.0736 1121.1898 1124.9381 1135.2305 1147.6711 1150.0184 1153.6580 1157.4393 1173.8034 1192.7625 1193.8565 1207.6724 1221.5547 1234.8455 1245.6831 1255.6410 1259.7542 1271.3867 1287.2169 1288.6256 1296.1827 1304.1773 1332.0254 1334.5892 1342.9746 1356.1800 1359.9497 1371.0579 1373.2149 1379.9731 1384.8353 1410.9171 1412.8496 1419.7763 1426.3292 1441.1366 1452.7660 1454.2239 1458.4602 1461.7847 1464.3589 1469.7757 1474.0462 1480.2682 1480.7110 1560.7989 1576.7682 1578.1297 1589.2495 1597.0560 1600.6344 2803.9301 2844.4607 2847.9347 2858.0350 2864.6183 2876.1766 2985.9263 3014.4699 3021.1776 3027.1599 3034.9294 3056.1669 3059.9177 3072.7951 3110.3596 3124.8541 3136.5723 3141.4055 3144.2645 3149.4035 3163.0368 3172.9740 3174.2839 3175.5041 3185.5041
redmass: 5.2953 5.7892 4.5442 4.8678 4.4740 3.3581 4.7589 3.8571 5.2688 4.6556 5.5104 4.3359 4.3591 3.7325 4.2418 1.2960 4.0626 3.2361 3.9733 2.0267 4.0167 3.5117 3.4504 3.9368 3.4844 3.2609 2.4700 3.5875 3.5091 3.2431 4.7372 5.7411 2.9203 3.9334 2.9962 3.7142 5.2103 4.3520 6.1065 3.4646 5.1526 5.1824 5.5588 5.5219 4.1798 3.8809 3.7242 2.9846 2.2391 1.7211 3.7372 3.5512 1.5906 2.9373 1.7744 2.5105 1.5438 1.7353 1.3167 1.6369 3.4283 2.2378 1.6021 1.4221 1.4797 4.8426 1.9362 1.3295 1.3222 3.0648 2.4888 6.6717 2.3014 3.8508 2.6892 1.6362 2.1670 1.7111 1.6733 1.6185 1.8454 1.7795 1.6361 2.1896 2.6845 3.4293 1.6861 1.0830 1.1061 1.3765 1.2718 2.0000 2.0697 2.0040 2.2139 1.6123 1.6899 1.3799 1.5898 1.5276 1.3374 1.2829 1.9644 3.8063 1.2906 1.5142 1.9294 4.6156 1.4605 4.0751 1.5287 2.1519 2.5780 2.0162 1.1782 2.0882 1.0801 1.0777 1.0695 1.4522 1.2438 2.2615 1.1211 1.1861 1.2293 6.5086 6.0338 6.3429 7.8992 6.2762 6.3310 1.0808 1.0689 1.0620 1.0697 1.0684 1.0674 1.0621 1.0725 1.0886 1.0903 1.0989 1.0863 1.0888 1.1009 1.0877 1.0874 1.0889 1.0929 1.0891 1.0902 1.1008 1.0946 1.0956 1.0934 1.1001
irintensity: 0.4348 0.1875 0.1410 1.7573 0.0516 0.1637 0.3849 1.9609 1.9407 0.4387 1.6863 0.0509 0.6023 0.4375 1.5298 0.4937 1.5709 0.7186 0.5103 0.6185 1.7249 6.7202 6.6805 2.1659 1.7022 1.1330 1.0828 0.2597 3.4561 5.0798 1.1666 1.5487 0.1695 5.6299 9.9021 0.8932 1.7102 2.3947 2.5726 0.5663 0.9645 0.7269 7.5555 16.9205 5.6988 2.2386 2.7618 8.6938 42.7835 39.8227 5.2182 15.0145 82.0753 17.8880 45.8642 4.9296 0.3375 8.6497 0.9371 23.1951 33.7387 15.9263 4.7867 0.9853 0.2478 11.0054 1.8414 0.0565 0.4032 39.2019 29.6988 76.5924 8.4307 3.4875 12.5429 2.3037 0.7479 3.2622 3.0758 3.5255 18.9791 9.1532 12.2628 17.3047 42.8587 30.3666 59.1580 15.2502 1.1557 3.9018 2.0344 6.0018 2.6902 123.7410 290.5773 14.6592 200.7987 8.3594 29.6699 0.7990 23.0917 3.7243 20.8965 52.4759 1.7097 1.2401 1.5679 16.8804 5.1252 4.6742 5.6234 79.4002 82.3610 17.4952 0.9348 168.9414 3.2842 0.4365 35.5849 114.7690 12.9377 69.6018 13.2749 6.0494 46.9890 17.2210 127.3462 80.8169 21.2889 2.5783 7.5607 64.5190 76.2025 77.3663 28.0935 20.3156 259.3695 22.3574 48.4285 50.7834 47.9265 19.0747 38.2296 11.7297 33.9876 10.3966 1.9757 11.6309 19.5615 5.0110 11.6463 39.0761 4.5531 20.8107 4.5052 9.0601
temp: 298.150 k
press: 1.00000 atm
elementType: 16 8 7 7 7 6 6 6 6 6 6 6 6 6 6 6 6 6 6 6 6 6 6 6 6 6 6 6 6 1 1 1 1 1 1 1 1 1 1 1 1 1 1 1 1 1 1 1 1 1 1 1 1 1
symmnumber: 1
zpe: 1145761.3 jmol-1
zpe.correction: 0.436397 hartree
zpe.thermalcorrener: 0.461530 hartree
zpe.thermalcorrenthalpy: 0.462474 hartree
zpe.thermalcorrgfe: 0.378871 hartree
zpe.sumelectzpe: -1564.962149 hartree
zpe.sumelectthermal: -1564.937017 hartree
zpe.sumelectthermalent: -1564.936073 hartree
zpe.sumelectthermalfe: -1565.019676 hartree
dipole: 2.1623 1.0750 1.6425
dipole: 2.9204
quadrupole: -143.2940 -177.1077 -171.2903
quadrupole: 1.1145 2.2940 2.2136
quadrupole: 20.6034 -13.2104 -7.3930 1.1145 2.2940 2.2136
hfenergy: -1565.3985469 hartree
pointgroup: C01 [X(C24H25N3O1S1)]
dipole: 0.8336288 -0.3458218 -0.7110877 debye
polarizability: 447.5906347|-13.1515808|250.9817688|-11.1172948|28.2496428|232.6646859 unknown
InChI: InChI=1S/C24H25N3OS/c1-26-12-14-27(15-13-26)21-16-18-6-2-3-7-22(18)29-23-10-9-19(17-20(21)23)28-24-8-4-5-11-25-24/h2-11,17,21H,12-16H2,1H3
charge 0 multiplicity 1
54 atoms
S  -1.953042 1.434046 1.843493
O  3.877431 1.697099 0.230754
N  -1.371526 -1.183812 -0.204711
N  -1.972229 -3.975118 0.365797
N  4.239382 -0.61018 -0.281092
C  -0.696116 -0.046013 -0.885817
C  -2.15969 -2.016691 -1.14947
C  -0.427959 -2.041837 0.560324
C  -2.914195 -3.124738 -0.398155
C  -1.191745 -3.141708 1.311198
C  -1.716044 0.91628 -1.581216
C  0.223133 0.738962 0.047606
C  -3.044069 1.175957 -0.880046
C  -0.249029 1.475585 1.16621
C  -2.649319 -5.101403 1.034652
C  1.601927 0.791997 -0.266924
C  -3.217937 1.438386 0.505385
C  -4.20978 1.198885 -1.696658
C  0.65695 2.231132 1.952175
C  2.496576 1.527214 0.53661
C  -4.511385 1.703419 1.030965
C  2.032023 2.255162 1.649097
C  -5.495312 1.464587 -1.184776
C  -5.645997 1.716613 0.197606
C  4.694228 0.660981 -0.24029
C  6.005704 1.050893 -0.618151
C  6.882162 0.04195 -1.057266
C  5.106446 -1.576448 -0.710847
C  6.431381 -1.303419 -1.106401
H  -0.036342 -0.433545 -1.708487
H  -1.49539 -2.486631 -1.920284
H  -2.899784 -1.382851 -1.666975
H  0.114846 -1.417257 1.28976
H  0.326845 -2.518043 -0.115276
H  -3.67345 -2.646377 0.272305
H  -3.453335 -3.757354 -1.128883
H  -0.468428 -3.789316 1.841833
H  -1.853553 -2.659694 2.075481
H  -1.945349 0.519714 -2.587469
H  -1.186171 1.874278 -1.750764
H  -1.901267 -5.734888 1.544884
H  -3.168769 -5.723371 0.28311
H  -3.404397 -4.777098 1.79625
H  1.974516 0.223125 -1.121646
H  -4.089756 1.001486 -2.769755
H  0.279475 2.809501 2.801745
H  -4.623697 1.907745 2.102213
H  2.737485 2.838112 2.247843
H  -6.364044 1.474358 -1.851559
H  -6.632418 1.92617 0.625285
H  6.29913 2.101618 -0.55783
H  7.903604 0.297474 -1.35757
H  4.707559 -2.596766 -0.728885
H  7.08612 -2.112466 -1.44198
