program: Gaussian 09
title: 000206232
version: EM64L-G09RevD.01
frameworkgroup: C1[X(C8H14N4)]
method: RPBEPBE
basis: SDD
operation: Freq
keyword: #pfreq=noraman
keyword: PBEPBE/SDD
title: #p freq=noraman PBEPBE/SDD
converged: YES YES NO NO
title: Mulliken charges:
elementType: N N N N C C C C C C C C H H H H H H H H H H H H H H
charge: -0.075943 -0.092699 -0.061858 -0.113857 -0.424983 -0.441450 -0.441079 -0.440603 -0.313995 -0.383667 -0.175198 -0.281490 0.230829 0.220552 0.229001 0.218264 0.222106 0.230094 0.227535 0.219601 0.210205 0.226839 0.247639 0.231781 0.271804 0.260573
chargesum: 0.00000
title: Mulliken charges with hydrogens summed into heavy atoms:
elementType: N N N N C C C C C C C C
charge: -0.075943 -0.092699 -0.061858 -0.113857 0.026397 0.005814 0.011121 0.006533 0.123049 0.095753 0.096606 -0.020917
polarizability: 1.35429119e+02 -1.06845082e+00 1.02766395e+02 8.13496557e+00 -1.34066348e+00 8.29550459e+01
1716.lowfreq: -35.5512 -10.6263 -5.0567 0.0003 0.0007 0.0007 28.6086 33.8296 40.5587
frequency: 13.3321 33.7187 39.9776 57.2716 91.0793 126.9141 231.6667 293.4864 340.6996 394.5556 427.4813 615.3212 636.3649 639.7433 667.2705 716.6303 774.6226 789.1391 804.6686 832.2282 842.3893 850.9135 877.4850 906.5049 916.3959 933.6901 952.3645 1019.0746 1020.0072 1042.7029 1067.5508 1073.1528 1098.1365 1115.4291 1169.2167 1176.2695 1183.3047 1207.2766 1218.8035 1236.5612 1249.8077 1268.8494 1284.1911 1294.2565 1299.2135 1309.0684 1310.4110 1319.8001 1326.0073 1371.0621 1389.6698 1425.9359 1457.3751 1464.3932 1470.6401 1471.6003 1479.6606 1489.8207 2920.9932 2987.4656 2997.1189 3004.6294 3020.6626 3031.9473 3038.5083 3055.5774 3069.6492 3075.9311 3090.8786 3101.8048 3241.9660 3255.0855
redmass: 2.2255 3.2336 3.0724 3.6983 2.7670 3.1379 3.6489 3.5398 2.5285 2.3027 2.5659 2.5564 3.3387 3.8870 3.3471 2.6678 1.5899 1.4295 1.4861 1.7794 1.3893 2.4590 3.5242 2.5994 6.2237 1.6335 4.8327 2.4327 2.9353 2.8492 2.3334 1.9277 2.0551 2.3469 1.6392 1.3304 1.6553 1.5790 1.1725 2.9519 1.3949 1.8158 1.3222 1.6481 1.2485 1.3581 1.8954 1.4886 1.3483 1.3534 3.1543 2.8259 1.1676 1.0826 1.0924 1.0831 1.0881 1.0940 1.0674 1.0653 1.0634 1.0596 1.0642 1.0626 1.0898 1.1013 1.1009 1.1024 1.1059 1.1061 1.0979 1.1008
irintensity: 0.2431 0.7143 1.0614 0.9509 0.4491 0.9420 2.2071 1.7085 0.2317 3.5189 10.2439 4.0332 7.8666 7.6313 22.3523 18.3824 5.0541 0.3089 28.7323 4.4789 18.3847 12.7208 10.9660 0.9042 13.7946 12.5991 23.3076 4.4197 12.5171 2.5041 27.8093 42.3515 3.0120 27.3965 1.2719 2.5173 8.6381 4.2935 3.8538 22.0017 13.7758 2.3722 4.5941 1.8397 1.4441 15.0580 3.2651 5.7396 2.3688 1.8705 9.3850 41.4393 2.5645 2.6234 26.3160 10.5887 1.0964 7.4942 42.1312 51.3551 41.5844 40.1594 45.6969 19.1109 13.3980 21.1550 0.3760 16.2752 105.8874 15.4954 1.2293 1.9789
temp: 298.150 k
press: 1.00000 atm
elementType: 7 7 7 7 6 6 6 6 6 6 6 6 1 1 1 1 1 1 1 1 1 1 1 1 1 1
symmnumber: 1
zpe: 580233.0 jmol-1
zpe.correction: 0.220999 hartree
zpe.thermalcorrener: 0.232468 hartree
zpe.thermalcorrenthalpy: 0.233412 hartree
zpe.thermalcorrgfe: 0.179714 hartree
zpe.sumelectzpe: -531.278365 hartree
zpe.sumelectthermal: -531.266896 hartree
zpe.sumelectthermalent: -531.265952 hartree
zpe.sumelectthermalfe: -531.319650 hartree
dipole: 3.8175 -0.8327 0.2808
dipole: 3.9173
quadrupole: -84.0370 -70.7200 -72.8900
quadrupole: 0.6869 -3.5292 -0.2123
quadrupole: -8.1547 5.1623 2.9924 0.6869 -3.5292 -0.2123
hfenergy: -531.4993642 hartree
pointgroup: C01[X(C8H14N4)]
dipole: -1.4606614 -0.2848637 -0.4007251 debye
dipolederiv: -0.8812207 -0.0026587 0.0487028 0.0109708 -0.3921364 -0.0225802 0.0999677 -0.075733 -0.4988866 -0.5325793 -0.0166625 -0.1432937 -0.1087757 -0.0584762 -0.0164791 -0.2221956 0.0165519 -0.217716 -0.2887696 0.1072534 0.0141113 0.262973 -0.2521658 0.0486419 0.1715735 -0.0094647 -0.0993123 -0.5355783 0.0120695 -0.1012344 -0.0458011 -0.3334362 -0.090746 -0.2358478 -0.0838472 -0.3818727 0.3139407 -0.1390266 -0.0041176 -0.2237059 0.2500994 -0.0007493 -0.0453164 -0.02768 0.3049249 0.4299978 0.1309423 -0.0388625 0.2123087 0.24732 0.0202221 -0.1129342 0.0581878 0.2901958 -0.0076302 0.0359131 0.1047711 -0.0267829 -0.0190198 0.0474538 0.1453787 0.0154707 -0.034087 0.0021296 -0.0250373 0.1051937 0.0583306 -0.0536155 -0.0767867 0.1272705 -0.0382959 -0.0070117 0.6574423 -0.0031948 0.077888 0.0160299 0.1489297 0.0908266 0.0381851 0.0669583 0.1835354 0.4406619 0.0087683 0.104056 0.0060722 0.1875624 -0.024014 0.2827795 0.0117206 0.2942189 0.5233037 -0.0974547 0.210787 -0.2114813 0.0282707 0.0238069 0.1782913 0.0481961 0.0687612 0.0283449 -0.0765971 0.0705945 -0.0066176 0.204975 0.2220058 0.0685602 0.2208298 0.1374414 -0.0669703 0.0794226 -0.1040865 0.0447686 0.0501332 0.0128218 -0.0873541 0.0553073 -0.1250918 -0.033518 -0.1347471 0.029558 -0.1217638 -0.0595701 0.0121087 0.005358 -0.016892 0.0615973 0.0247089 0.1240418 -0.005525 0.0648701 -0.1232214 0.0273885 -0.0008953 0.0652671 0.0583391 -0.1246896 -0.0811771 -0.0953671 -0.0295997 0.0608333 -0.0215008 -0.0964511 -0.0692132 -0.1000493 -0.1401474 0.1319208 -0.0240167 0.0926008 0.0080439 0.018462 -0.0408006 0.0262514 0.0674755 0.0556275 -0.0669527 -0.0751742 -0.0241583 -0.0071643 -0.0744784 -0.0302395 -0.097882 -0.0794496 0.0521713 0.0368987 -0.1048747 0.0186557 0.0276409 0.038648 -0.04626 0.0543774 -0.1232192 -0.1930709 -0.1012839 0.0451692 -0.0631054 0.0477424 0.0116401 0.026014 0.0131348 0.073859 0.0222055 0.0278429 -0.0021307 0.0476295 -0.1193575 0.0722847 -0.016813 0.0456437 0.0495353 -0.0200444 0.0015106 0.0055167 -0.0503618 0.0068106 -0.1249196 -0.0605279 -0.066381 -0.1258899 0.0267877 0.0186528 -0.0513623 0.0400152 -0.0582063 0.0905983 -0.0557769 0.0245198 0.0516757 0.0118918 0.0306574 0.0274957 0.0317518 0.0297765 -0.1113514 0.0084031 -0.0609734 -0.0191029 0.1397723 0.0104791 -0.0353044 0.005816 0.0865195 -0.0945096 -0.0421335 -0.0922998 0.094049 0.0952326 -0.0115808 -0.0584943 -0.0006392 0.0917119 -0.078794 -0.0582355 -0.0837543 0.0760805 unknown
polarizability: 134.0714573|-2.5288842|95.5586636|10.9130914|9.69961|91.5204386 unknown
InChI: InChI=1S/C8H14N4/c1-2-4-11(3-1)5-6-12-8-9-7-10-12/h7-8H,1-6H2
charge 0 multiplicity 1
26 atoms
N  -1.830223 -0.402717 -0.791799
N  1.85912 0.10857 -0.108308
N  2.046835 1.088904 0.875347
N  3.881019 -0.333753 0.762257
C  -2.534823 0.915473 -0.738983
C  -2.880748 -1.370964 -0.365056
C  -3.521306 0.853177 0.48359
C  -3.682338 -0.673962 0.784282
C  -0.581894 -0.443065 0.009722
C  0.598528 0.053275 -0.861222
C  2.958164 -0.723924 -0.152091
C  3.281367 0.770274 1.360433
H  -3.102677 1.049304 -1.678704
H  -1.809323 1.743706 -0.662836
H  -2.430735 -2.334414 -0.071616
H  -3.550032 -1.558449 -1.227017
H  -4.486367 1.328086 0.234256
H  -3.107973 1.387041 1.356976
H  -3.246138 -0.925816 1.767695
H  -4.739754 -0.991197 0.797926
H  -0.387699 -1.487875 0.314676
H  -0.620153 0.173157 0.936911
H  0.380921 1.063322 -1.247762
H  0.731077 -0.62256 -1.722397
H  3.055613 -1.563536 -0.835436
H  3.748538 1.349344 2.152358
