program: Gaussian 09
title: 000212069
version: EM64L-G09RevD.01
frameworkgroup: C1[X(C14H13N3)]
method: RPBEPBE
basis: SDD
operation: Freq
keyword: #pfreq=noraman
keyword: PBEPBE/SDD
title: #p freq=noraman PBEPBE/SDD
converged: YES YES NO NO
title: Mulliken charges:
elementType: N N N C C C C C C C C C C C C C C H H H H H H H H H H H H H
charge: -0.200089 -0.039971 -0.716500 0.320694 -0.550005 0.231424 0.475213 -0.311003 -0.478627 -0.592539 0.550816 -0.414475 -0.356427 -0.441037 -0.222631 -0.216486 -0.242826 0.222420 0.258255 0.244116 0.262971 0.230786 0.213431 0.255507 0.229525 0.227222 0.225984 0.228682 0.302578 0.302992
chargesum: 0.00000
title: Mulliken charges with hydrogens summed into heavy atoms:
elementType: N N N C C C C C C C C C C C C C C
charge: -0.200089 -0.039971 -0.110930 0.320694 -0.069331 0.231424 0.475213 -0.066887 -0.215656 -0.361754 0.550816 -0.201043 -0.100920 -0.211512 0.004591 0.009498 -0.014144
polarizability: 2.03839978e+02 2.39682133e+00 1.71181322e+02 1.56413329e+01 1.28456277e+01 1.26164015e+02
1716.lowfreq: 0.0006 0.0007 0.0010 1.9977 7.5902 14.7475 19.7409 30.8349 42.1166
frequency: 19.5088 30.7134 42.0750 116.3629 163.0038 190.5399 226.6995 266.8726 300.8918 303.8172 336.5005 348.7777 378.7260 403.4775 427.2319 445.3233 468.5025 482.9436 569.8330 588.5288 616.4393 619.7157 637.8567 697.4718 712.9409 742.9739 749.6059 765.4616 799.2008 802.9130 809.5694 847.2477 855.7981 860.0928 902.8349 929.7202 935.6768 938.7806 979.2111 989.9080 997.8246 1026.4859 1035.9874 1046.5692 1083.9254 1120.2385 1170.1600 1172.3178 1173.5410 1187.4800 1207.3171 1233.5198 1257.1629 1289.4040 1311.4196 1329.5465 1349.4315 1368.3651 1387.6187 1394.2233 1415.7751 1443.4868 1459.5876 1471.2529 1485.5060 1515.6015 1582.2750 1596.8590 1615.8928 1639.2592 1651.0671 2988.7482 3058.5633 3111.8919 3121.7268 3124.7641 3133.3083 3135.6226 3147.0921 3159.4685 3163.3278 3219.7966 3574.1692 3714.8848
redmass: 4.2149 4.4053 4.6378 4.8714 4.7013 5.2578 3.8861 3.6506 1.2133 2.9572 1.2426 2.8432 4.3030 2.8125 2.7115 3.0242 4.4390 4.2903 5.2486 4.8326 6.3312 5.0864 3.5273 3.6048 1.7085 2.9374 4.0983 2.7448 1.6070 3.6014 1.3238 5.7393 1.2524 1.8014 1.5822 1.3385 2.2075 2.3597 1.3862 6.2609 1.3239 2.2182 1.5030 2.4922 1.6531 2.1014 1.3986 1.0825 1.5675 1.1145 2.7381 2.1870 1.5636 1.8820 1.6386 2.0622 1.4982 3.9085 6.1993 3.3836 5.1193 2.1052 1.1814 4.3183 2.1792 4.5156 7.2214 6.1189 6.0358 1.2487 4.9277 1.0635 1.0976 1.0876 1.0884 1.0860 1.0917 1.0912 1.0961 1.0958 1.1015 1.0970 1.0448 1.1041
irintensity: 0.3184 0.7795 0.1693 3.3497 1.2802 0.1610 1.7532 3.7200 231.6503 17.4439 69.8876 5.3380 1.7464 0.3539 4.8455 8.2251 1.1110 1.9640 12.6017 5.5320 0.3912 5.4277 0.1630 3.7542 85.5922 8.6736 6.2315 30.3056 36.9728 4.5670 10.6807 42.0659 0.6258 63.2413 9.1887 0.0171 0.5513 5.5742 0.0469 0.4306 0.1073 8.5017 5.9651 7.3290 11.3978 11.8228 26.7737 3.9469 13.1128 1.2807 2.9994 15.5441 17.7330 12.1160 44.1663 36.6434 25.5624 19.9825 6.1999 4.6687 19.5835 12.2286 16.6429 48.9890 12.6493 120.2548 37.4353 1.8513 5.2508 80.4352 161.3836 40.9586 2.3590 9.6435 15.5117 0.3103 24.6911 13.3932 35.0117 11.7530 23.6255 4.2470 68.1827 19.2235
temp: 298.150 k
press: 1.00000 atm
elementType: 7 7 7 6 6 6 6 6 6 6 6 6 6 6 6 6 6 1 1 1 1 1 1 1 1 1 1 1 1 1
symmnumber: 1
zpe: 627897.2 jmol-1
zpe.correction: 0.239153 hartree
zpe.thermalcorrener: 0.253144 hartree
zpe.thermalcorrenthalpy: 0.254088 hartree
zpe.thermalcorrgfe: 0.196669 hartree
zpe.sumelectzpe: -704.353529 hartree
zpe.sumelectthermal: -704.339539 hartree
zpe.sumelectthermalent: -704.338594 hartree
zpe.sumelectthermalfe: -704.396013 hartree
dipole: 1.2214 -3.2839 -0.2200
dipole: 3.5106
quadrupole: -78.9465 -97.3505 -94.6014
quadrupole: -2.9640 6.1078 2.5918
quadrupole: 11.3529 -7.0510 -4.3019 -2.9640 6.1078 2.5918
hfenergy: -704.5926827 hartree
pointgroup: C01 [X(C14H13N3)]
dipole: -0.588963 1.2209253 0.2648161 debye
polarizability: 199.8206186|8.6315113|176.0725936|-20.0606385|-3.173287|125.2921032 unknown
InChI: InChI=1S/C14H13N3/c15-13-6-7-14-12(8-13)9-16-17(14)10-11-4-2-1-3-5-11/h1-9H,10,15H2
charge 0 multiplicity 1
30 atoms
N  -0.035732 -1.172005 -0.88212
N  -0.295954 -2.519629 -0.608495
N  -4.629483 1.312925 1.120915
C  -1.076597 -0.349984 -0.446779
C  1.20915 -0.800853 -1.556705
C  -2.065794 -1.216339 0.132643
C  2.17501 0.000686 -0.684057
C  -1.261738 1.052116 -0.499201
C  -1.513566 -2.540574 -0.000076
C  -3.265635 -0.675517 0.664938
C  -3.46351 0.72455 0.611814
C  -2.452695 1.57079 0.028923
C  2.431653 -0.390757 0.654008
C  2.854797 1.122522 -1.2163
C  3.354522 0.328773 1.443434
C  3.784082 1.841513 -0.428913
C  4.035872 1.44608 0.904211
H  0.977916 -0.232746 -2.478789
H  1.66833 -1.758243 -1.861078
H  -0.502252 1.71837 -0.919801
H  -1.936324 -3.495008 0.309169
H  -4.025873 -1.328406 1.108887
H  -2.623406 2.654444 0.005779
H  1.900331 -1.253803 1.071932
H  2.658882 1.436079 -2.249956
H  3.544359 0.01951 2.477498
H  4.304502 2.708033 -0.852384
H  4.752336 2.003239 1.518209
H  -4.763681 2.318191 1.085179
H  -5.358306 0.744544 1.540415
