program: Gaussian 09
title: 000206222
version: EM64L-G09RevD.01
frameworkgroup: C1[X(C18H18N2O2)]
method: RPBEPBE
basis: SDD
operation: Freq
keyword: #p
keyword: freq=noraman
keyword: PBEPBE/SDD
title: #p freq=noraman PBEPBE/SDD
converged: YES YES NO NO
title: Mulliken charges:
elementType: O O N N C C C C C C C C C C C C C C C C C C H H H H H H H H H H H H H H H H H H
charge: -0.302125 -0.257559 -0.182087 -0.670721 -0.412359 -0.397667 -0.457435 -0.444974 -0.498058 0.203647 0.016951 0.305212 0.210066 -0.434685 -0.399138 0.026445 0.179078 0.200838 -0.356615 -0.376188 -0.254199 -0.214489 0.227549 0.221885 0.220321 0.250677 0.235577 0.223435 0.221531 0.238173 0.241849 0.254661 0.223521 0.276678 0.391653 0.288753 0.279749 0.255130 0.233094 0.231824
chargesum: 0.00000
title: Mulliken charges with hydrogens summed into heavy atoms:
elementType: O O N N C C C C C C C C C C C C C C C C C C
charge: -0.302125 -0.257559 -0.182087 0.009684 0.037076 0.073330 0.001577 0.014730 -0.001549 0.203647 0.016951 0.305212 0.210066 -0.211163 -0.122460 0.026445 0.179078 0.200838 -0.076865 -0.121058 -0.021105 0.017336
polarizability: 3.16475036e+02 -3.23873788e+01 2.52387132e+02 1.78472519e+01 1.15400344e+01 1.17042615e+02
1716.lowfreq: -12.5045 -0.0007 0.0002 0.0004 6.7361 10.0974 31.3817 38.3481 60.4680
frequency: 30.8376 38.3006 60.4281 72.1116 74.8095 118.5846 136.2746 143.2939 164.3374 208.9240 256.7959 267.7134 278.7982 297.9966 306.1672 325.9857 347.2791 394.6259 413.1753 432.0108 467.2760 478.2539 500.2428 510.4139 531.9259 580.7484 597.5839 616.4168 630.1613 644.5136 662.8761 673.0256 690.6130 734.3130 755.6885 768.1367 782.2412 794.9379 801.8435 826.9895 834.5700 836.5378 875.4731 880.3987 881.1434 884.0420 917.9958 931.1046 943.2517 968.3219 981.6701 993.8680 998.3045 1011.6972 1021.6163 1028.7105 1046.9962 1065.8045 1091.9177 1107.4081 1127.5813 1160.0436 1168.5511 1178.6810 1191.8145 1194.6296 1209.0443 1220.6351 1226.5373 1245.1980 1255.5735 1269.6691 1286.0120 1302.4869 1304.2423 1318.8923 1322.8710 1350.2619 1357.9981 1396.4744 1399.5496 1443.9374 1455.2935 1462.4299 1464.9254 1467.6154 1473.7604 1477.7070 1492.5065 1510.5388 1546.9037 1561.4617 1588.7911 1601.7007 1616.2378 1639.7640 2963.6409 2997.2467 3001.5250 3009.1879 3017.1253 3024.3736 3058.5811 3073.4343 3082.1584 3094.6372 3120.8195 3129.2800 3135.4130 3148.4495 3159.6751 3161.3518 3172.1514 3613.8884
redmass: 4.1913 3.8318 3.8615 5.2085 2.0151 3.4603 5.7180 4.0221 4.0351 3.6458 5.0986 4.0675 5.3032 3.5328 4.7209 3.9196 4.6171 3.1393 3.0612 3.4233 4.3439 1.2071 7.5932 3.7143 3.7128 7.4301 7.3720 5.6064 3.1679 2.8265 4.8883 3.5422 3.0259 3.9621 6.2424 1.5995 2.2327 3.6662 3.5117 1.8381 1.7497 2.2827 1.7293 1.5918 3.6751 2.1964 2.1750 2.3742 1.8547 1.3637 1.3453 2.8489 1.3305 2.7785 2.6004 1.9924 2.2038 2.3096 2.2756 2.4253 1.7812 1.2057 1.2739 1.2826 1.5301 1.5054 3.2412 1.1586 2.6477 1.4490 1.5628 1.3693 1.3101 1.2549 1.3786 1.3537 2.0448 2.9008 1.5019 9.1749 5.7455 2.9035 4.0598 2.6932 1.0871 1.1224 1.0838 1.0992 1.1013 3.6671 8.4236 4.9080 2.4098 2.6463 5.3105 5.7816 1.0576 1.0628 1.0647 1.0601 1.0997 1.0664 1.1017 1.1019 1.1026 1.1056 1.0693 1.0879 1.0858 1.0897 1.0959 1.0950 1.1004 1.0848
irintensity: 0.9229 0.5437 0.2226 3.8534 0.4004 1.5592 0.7830 0.0593 0.3089 14.2746 2.5040 1.1062 0.7794 1.9755 6.8665 9.9156 7.1244 3.3793 13.0338 1.0276 9.2824 128.5039 0.3127 2.3634 7.0867 0.4077 13.9421 3.5459 4.3400 7.6881 6.1696 13.4902 23.4162 2.1933 4.7104 99.2451 11.1607 7.4580 6.0422 0.1971 53.4062 11.7312 49.1019 1.2389 21.6814 34.2695 18.4501 18.7826 16.7439 2.8616 1.2213 28.3815 0.5206 12.1102 67.7535 24.7199 25.0323 12.6028 26.6618 1.6817 56.7482 6.7772 9.9727 2.4106 13.7642 8.1126 61.8489 3.5265 0.4848 6.6128 15.6566 12.7327 5.4224 1.8633 4.5388 33.9738 110.9135 58.8452 90.2762 52.7717 84.7124 222.9487 29.4926 6.4426 1.3529 14.8430 7.2625 8.7552 9.3666 12.5145 209.0572 19.5873 18.5038 160.6903 299.4303 306.3693 26.3200 36.5347 54.4996 37.3908 4.7588 62.1017 13.8363 6.4383 15.2031 78.4867 629.8816 31.2637 2.9733 6.1268 12.0485 11.8601 25.2271 54.6730
temp: 298.150 k
press: 1.00000 atm
elementType: 8 8 7 7 6 6 6 6 6 6 6 6 6 6 6 6 6 6 6 6 6 6 1 1 1 1 1 1 1 1 1 1 1 1 1 1 1 1 1 1
symmnumber: 1
zpe: 849173.6 jmol-1
zpe.correction: 0.323433 hartree
zpe.thermalcorrener: 0.341538 hartree
zpe.thermalcorrenthalpy: 0.342483 hartree
zpe.thermalcorrgfe: 0.276701 hartree
zpe.sumelectzpe: -955.114317 hartree
zpe.sumelectthermal: -955.096212 hartree
zpe.sumelectthermalent: -955.095268 hartree
zpe.sumelectthermalfe: -955.161049 hartree
dipole: -5.7806 -3.1851 -0.3377
dipole: 6.6086
quadrupole: -119.6724 -118.5589 -131.8363
quadrupole: -15.9550 -2.6948 0.6299
quadrupole: 3.6835 4.7969 -8.4804 -15.9550 -2.6948 0.6299
hfenergy: -955.4377503 hartree
pointgroup: C01 [X(C18H18N2O2)]
dipole: -2.2398996 1.3181869 0.0735976 debye
polarizability: 319.4680453|30.1247651|249.6580674|-7.8723027|17.1868385|116.7786697 unknown
InChI: InChI=1S/C18H18N2O2/c19-15-8-7-13-17(21)12-5-1-2-6-16(12)22-18(13)14(15)11-20-9-3-4-10-20/h1-2,5-8H,3-4,9-11,19H2
charge 0 multiplicity 1
40 atoms
O  0.617722 0.758599 0.495177
O  3.403043 -2.255555 -0.441552
N  -3.417665 0.384812 0.001833
N  -3.067702 -2.327278 0.226922
C  -4.365766 1.42743 0.510668
C  -3.158814 0.823295 -1.409482
C  -3.89888 2.790582 -0.102146
C  -3.089076 2.385856 -1.379272
C  -2.154959 0.326684 0.82914
C  -1.21185 -0.778235 0.381572
C  0.177762 -0.565926 0.265618
C  -1.705317 -2.105543 0.149612
C  1.105221 -1.603889 -0.047115
C  -0.786832 -3.167219 -0.150635
C  0.580546 -2.913384 -0.241979
C  2.550143 -1.346395 -0.161174
C  2.95706 0.066256 0.078803
C  1.989607 1.055155 0.396204
C  4.318889 0.459084 0.000066
C  2.351206 2.39949 0.631646
C  4.697745 1.792779 0.230171
C  3.708711 2.763503 0.547143
H  -4.387051 1.424294 1.613875
H  -5.380615 1.177692 0.14848
H  -4.008095 0.488326 -2.03409
H  -2.241755 0.347056 -1.793291
H  -3.262064 3.346488 0.608234
H  -4.76231 3.434661 -0.342974
H  -3.517207 2.82179 -2.298481
H  -2.042355 2.729477 -1.308581
H  -2.485261 0.117474 1.867079
H  -1.616063 1.294384 0.839795
H  -1.177322 -4.17846 -0.313945
H  1.297128 -3.708046 -0.474534
H  -3.658947 -1.467225 0.181874
H  -3.444971 -3.256061 0.050994
H  5.049736 -0.318823 -0.2451
H  1.572835 3.128617 0.87553
H  5.750646 2.086298 0.167305
H  4.000579 3.803755 0.728314
