program: Gaussian 09
title: 000212070
version: EM64L-G09RevD.01
frameworkgroup: C1[X(C15H11N3O4)]
method: RPBEPBE
basis: SDD
operation: Freq
keyword: #p
keyword: freq=noraman
keyword: PBEPBE/SDD
title: #p freq=noraman PBEPBE/SDD
converged: NO YES NO NO
title: Mulliken charges:
elementType: O O O O N N N C C C C C C C C C C C C C C C H H H H H H H H H H H
charge: -0.252156 -0.251125 -0.203774 -0.208906 -0.286276 0.005567 0.016549 0.321365 0.185044 -0.267481 -0.496437 0.165090 -0.424105 0.178233 0.414025 -0.356573 -0.297523 -0.285794 -0.360161 -0.375868 0.336552 -0.535958 0.315836 0.300230 0.280663 0.289857 0.277478 0.304970 0.258634 0.244385 0.228022 0.227884 0.251754
chargesum: 0.00000
title: Mulliken charges with hydrogens summed into heavy atoms:
elementType: O O O O N N N C C C C C C C C C C C C C C C
charge: -0.252156 -0.251125 -0.203774 -0.208906 -0.286276 0.005567 0.016549 0.321365 0.185044 0.048355 -0.196207 0.165090 -0.143442 0.178233 0.414025 -0.066716 -0.020045 0.019175 -0.101527 -0.131483 0.336552 0.171702
polarizability: 4.22493373e+02 -1.29502603e+01 2.01975236e+02 -7.24702008e-02 9.05342121e-02 7.85014854e+01
1716.lowfreq: -3.0307 -0.0005 0.0005 0.0009 2.6230 7.4253 16.3744 31.2828 60.1017
frequency: 16.0682 31.2827 60.0991 73.0428 74.2065 87.8016 138.9338 144.5478 157.2948 202.3388 219.3222 229.3930 246.2679 277.9582 296.2928 336.4652 353.6998 398.9789 410.9526 419.4313 435.0254 470.7689 507.7683 512.4132 536.0823 562.8546 594.3357 610.5175 626.1523 637.6669 679.0419 691.3367 704.1156 756.0133 762.6314 768.5778 769.0344 798.0653 829.6858 857.7841 857.9098 864.9370 881.7410 925.2170 939.5244 980.2717 997.1096 999.6311 1000.6624 1003.8380 1031.9912 1066.0696 1097.4735 1111.4025 1120.6121 1142.1868 1156.5304 1181.7225 1195.7616 1215.6379 1233.1780 1246.7907 1260.8926 1270.2072 1303.6462 1320.1389 1367.6060 1372.3527 1401.7499 1426.3459 1435.7482 1437.3573 1455.7718 1468.4774 1470.5638 1483.9341 1494.8434 1541.7843 1578.4461 1590.8162 1618.2246 1623.4047 2970.8357 3063.5335 3134.8625 3157.3833 3158.4885 3177.0865 3181.9993 3183.2645 3196.9936 3217.9569 3220.7617
redmass: 6.6086 4.6692 12.3500 4.8909 6.8683 6.3075 5.0250 6.1894 6.1952 9.0499 1.1632 5.3729 5.1464 4.7394 4.9812 6.5982 9.6819 6.8094 10.4685 3.0404 3.1448 4.4596 2.9918 7.1232 6.4399 4.3445 7.5013 6.7146 6.3908 7.0570 8.4185 4.3407 5.6638 8.4469 4.3091 6.1573 4.0487 6.9935 1.2670 1.3060 1.6557 1.5434 7.8203 4.0893 1.5252 8.7315 1.3501 1.3402 3.0315 1.3157 4.7657 2.1091 3.3901 1.2597 1.3527 1.5695 1.3142 1.3742 2.0729 4.1777 2.5169 3.2055 1.5634 4.5534 1.4894 3.2677 10.5605 4.8767 3.9877 5.3466 1.1885 4.3044 6.2023 1.0496 1.0894 4.3951 2.4185 9.0120 8.4164 9.1226 6.6646 7.5369 1.0325 1.1044 1.1002 1.0883 1.0898 1.0972 1.0913 1.0931 1.0943 1.0978 1.0956
irintensity: 0.1817 0.6033 0.2186 2.6517 0.9240 1.3394 7.1892 0.6530 3.6447 0.8983 0.0304 2.8837 1.6394 17.9330 0.4547 0.0006 1.9305 2.9510 0.8999 0.0872 4.8259 0.8072 7.9456 1.0210 4.2625 1.8066 34.0333 45.6090 20.7333 6.4242 25.6438 8.3881 14.6373 48.4948 2.7582 1.0179 16.3435 2.2238 5.3694 17.0344 81.6712 18.1868 218.0047 20.3092 35.4406 63.4015 0.8052 0.5603 4.7384 0.0213 11.3150 59.6619 10.8061 0.1605 14.7284 55.7255 26.2857 579.6417 157.9886 472.0216 23.5376 165.2107 38.5139 47.3043 105.7872 640.6340 107.5176 5.2274 75.1543 64.4320 9.8062 56.5122 41.9787 15.1295 44.9674 10.2495 62.1886 165.6364 30.0643 65.3793 360.9037 1.5181 69.4629 40.4473 23.5895 0.6815 8.0474 6.1686 2.5194 5.9052 37.1507 1.0746 3.2572
temp: 298.150 k
press: 1.00000 atm
elementType: 8 8 8 8 7 7 7 6 6 6 6 6 6 6 6 6 6 6 6 6 6 6 1 1 1 1 1 1 1 1 1 1 1
symmnumber: 1
zpe: 622775.4 jmol-1
zpe.correction: 0.237203 hartree
zpe.thermalcorrener: 0.255226 hartree
zpe.thermalcorrenthalpy: 0.256170 hartree
zpe.thermalcorrgfe: 0.189179 hartree
zpe.sumelectzpe: -1041.716294 hartree
zpe.sumelectthermal: -1041.698270 hartree
zpe.sumelectthermalent: -1041.697326 hartree
zpe.sumelectthermalfe: -1041.764318 hartree
dipole: 7.3776 -3.4358 0.0147
dipole: 8.1384
quadrupole: -142.9993 -116.9923 -128.4751
quadrupole: -11.8144 0.2387 -0.0344
quadrupole: -13.5104 12.4966 1.0138 -11.8144 0.2387 -0.0344
hfenergy: -1041.9534964 hartree
pointgroup: C01 [X(C15H11N3O4)]
dipole: 2.9105349 -1.0946944 0.7632413 debye
polarizability: 422.6279245|-8.4704084|163.6071696|8.2405567|-57.0286639|116.7350009 unknown
InChI: InChI=1S/C15H11N3O4/c1-22-13-5-2-10(3-6-13)15(19)17-14-7-4-12(18(20)21)8-11(14)9-16-17/h2-9H,1H3
charge 0 multiplicity 1
33 atoms
O  0.464633 1.770233 -1.136283
O  6.523191 0.159663 0.011471
O  -6.476971 0.855433 -0.542539
O  -6.373148 -1.045372 0.714209
N  -0.176797 -0.065094 0.091331
N  0.072978 -1.230127 0.865666
N  -5.819035 -0.070317 0.071858
C  -1.563187 0.148666 -0.05845
C  -2.205721 -0.923538 0.650664
C  -2.312757 1.15041 -0.725964
C  -3.612478 -1.014195 0.705277
C  0.8628 0.773399 -0.462723
C  -1.131013 -1.725428 1.188694
C  2.307232 0.486655 -0.257025
C  -4.337198 -0.011566 0.03795
C  -3.712027 1.056177 -0.66786
C  3.196188 1.419518 -0.881401
C  2.874668 -0.590678 0.4804
C  4.582587 1.285636 -0.77549
C  4.271208 -0.73277 0.592729
C  5.132075 0.204202 -0.034516
C  7.15543 -0.933688 0.762169
H  -1.810567 1.956547 -1.259314
H  -4.137768 -1.81395 1.233109
H  -1.195427 -2.631439 1.789717
H  -4.346103 1.797297 -1.161394
H  2.759868 2.247726 -1.447882
H  2.214575 -1.312196 0.962064
H  5.264329 1.996665 -1.250913
H  4.674549 -1.572256 1.166731
H  6.890882 -1.917564 0.330592
H  6.867937 -0.901701 1.830159
H  8.236165 -0.760447 0.661263
