program: Gaussian 09
title: 000212045
version: EM64L-G09RevD.01
frameworkgroup: C1[X(C10H11NO5)]
method: RPBEPBE
basis: SDD
operation: Freq
keyword: #p
keyword: freq=noraman
keyword: PBEPBE/SDD
title: #p freq=noraman PBEPBE/SDD
converged: YES YES NO NO
title: Mulliken charges:
elementType: O O O O O N C C C C C C C C C C H H H H H H H H H H H
charge: -0.431607 -0.463300 -0.284524 -0.432243 -0.483731 -0.286753 -0.231806 0.409270 0.198057 -0.491201 -0.295225 0.141353 -0.445612 -0.505475 0.135837 0.181773 0.214473 0.238383 0.225864 0.241444 0.332683 0.270516 0.292003 0.335916 0.372279 0.384430 0.377197
chargesum: 0.00000
title: Mulliken charges with hydrogens summed into heavy atoms:
elementType: O O O O O N C C C C C C C C C C
charge: -0.095692 -0.091021 -0.284524 -0.047813 -0.106534 0.045930 -0.017334 0.409270 0.198057 -0.026955 -0.053780 0.141353 -0.175096 -0.213471 0.135837 0.181773
polarizability: 1.63856492e+02 -8.19351671e+00 1.49122943e+02 4.35421305e+00 -5.02628713e+00 7.87444846e+01
1716.lowfreq: -8.2562 -0.0010 0.0003 0.0008 1.8417 7.3898 44.9963 73.4180 94.0391
frequency: 44.9873 73.4077 94.0316 146.8414 187.2305 221.2585 231.4283 252.9224 263.2723 278.5586 303.6570 310.3445 323.3388 347.0314 382.9582 409.5976 442.9943 454.0149 478.5542 499.1809 513.1090 537.2721 564.2684 591.8273 619.3121 642.5064 652.1224 697.3696 711.6541 765.5118 781.5812 818.6585 857.0388 865.5802 886.0452 904.1470 940.7058 1020.1588 1043.1704 1054.4823 1101.3998 1128.5624 1149.7830 1172.2731 1188.5804 1201.4203 1217.0312 1237.0598 1256.8289 1275.8716 1302.0064 1313.0235 1336.2120 1352.5393 1390.1014 1407.8563 1410.7882 1420.8263 1444.5745 1468.5486 1510.6120 1606.0807 1634.8627 1643.5720 2928.7037 2967.6938 2997.6368 3060.6489 3139.2458 3167.0258 3326.8374 3529.4038 3534.0137 3549.3962 3619.1562
redmass: 6.3706 6.3438 8.4925 7.4211 7.2702 6.3085 2.6956 5.1212 1.4899 4.9476 2.4089 1.7247 2.8185 6.9779 4.3521 5.5686 3.0609 2.7523 1.1138 3.2284 2.7063 1.5421 3.4449 3.2608 3.0338 6.4469 3.6458 5.1882 4.1892 5.2196 4.5690 4.3012 2.4688 2.6640 2.4950 1.4796 2.3126 3.6496 4.2704 3.8360 1.8896 2.1416 1.3931 1.5825 1.3262 1.2854 1.4429 1.4380 1.7607 1.3171 1.5661 2.4056 1.8782 1.4699 1.4300 3.7359 2.9351 1.4396 3.0619 1.1113 4.0432 7.4375 7.1754 5.9229 1.0828 1.0827 1.0640 1.1000 1.0907 1.0919 1.0640 1.0649 1.0663 1.0771 1.0665
irintensity: 1.5018 6.3871 1.9994 7.1557 1.7443 3.0074 74.0035 8.0174 53.4496 3.1840 48.7961 115.7750 32.7574 20.8675 2.1582 0.7703 19.9571 23.1208 128.2169 27.4318 43.5853 43.3506 10.0168 67.2543 9.2398 19.0585 66.3257 42.0888 3.9224 18.7812 17.3188 24.5978 9.3160 20.5382 9.3273 36.8315 13.9889 134.6018 18.5493 153.7673 83.9832 67.7426 7.2150 42.2509 103.6837 36.9095 59.0964 27.5983 126.1593 15.5303 37.2050 4.5740 137.2929 49.5643 43.3548 13.7363 34.7061 25.6402 3.8010 31.7807 136.9097 36.0438 7.0874 274.8675 45.1362 33.3677 45.3878 23.7842 11.5039 2.6089 83.7209 88.5109 5.5018 34.8523 61.7840
temp: 298.150 k
press: 1.00000 atm
elementType: 8 8 8 8 8 7 6 6 6 6 6 6 6 6 6 6 1 1 1 1 1 1 1 1 1 1 1
symmnumber: 1
zpe: 533548.3 jmol-1
zpe.correction: 0.203218 hartree
zpe.thermalcorrener: 0.217593 hartree
zpe.thermalcorrenthalpy: 0.218537 hartree
zpe.thermalcorrgfe: 0.162783 hartree
zpe.sumelectzpe: -817.338412 hartree
zpe.sumelectthermal: -817.324037 hartree
zpe.sumelectthermalent: -817.323093 hartree
zpe.sumelectthermalfe: -817.378847 hartree
dipole: -1.2107 2.5432 -2.5776
dipole: 3.8181
quadrupole: -86.9921 -83.6536 -97.5553
quadrupole: -25.0091 5.7514 -4.5284
quadrupole: 2.4082 5.7467 -8.1549 -25.0091 5.7514 -4.5284
hfenergy: -817.5416299 hartree
pointgroup: C01 [X(C10H11N1O5)]
dipole: 0.417325 1.0601884 0.9789201 debye
polarizability: 163.0598433|8.7226804|149.9224056|6.4729208|2.0676413|78.741671 unknown
InChI: InChI=1S/C10H11NO5/c12-6-1-4-5(2-7(6)13)9(15)10(16)11-3-8(4)14/h1-2,8-9,11-15H,3H2
charge 0 multiplicity 1
27 atoms
O  0.966065 2.716705 -0.803494
O  1.288975 -2.663928 0.692922
O  2.933305 -1.617186 -1.079002
O  -3.800887 1.041181 -0.436513
O  -3.511938 -1.64315 -0.184263
N  2.91482 0.517736 -0.136905
C  0.931169 1.955838 0.472868
C  -0.142772 0.87904 0.314213
C  0.043674 -0.528936 0.447489
C  2.353004 1.47184 0.827519
C  1.38845 -1.218442 0.77084
C  2.48823 -0.779479 -0.232241
C  -1.438851 1.379922 0.018672
C  -1.072184 -1.389847 0.289905
C  -2.535545 0.524188 -0.143734
C  -2.340091 -0.874445 -0.00469
H  0.615497 2.642796 1.2913
H  3.027413 2.346131 0.868195
H  2.352537 1.024419 1.840328
H  1.704109 -0.970441 1.804376
H  3.53575 0.856777 -0.874701
H  -1.590695 2.454241 -0.118849
H  -0.895686 -2.465763 0.398277
H  1.359306 3.611795 -0.632303
H  1.817275 -2.922607 -0.122699
H  -4.440767 0.28642 -0.524887
H  -3.331065 -2.610104 -0.104122
