program: Gaussian 09
title: 000212051
version: EM64L-G09RevD.01
frameworkgroup: C1[X(C17H31N3)]
method: RPBEPBE
basis: SDD
operation: Freq
keyword: #pfreq=noraman
keyword: PBEPBE/SDD
title: #p freq=noraman PBEPBE/SDD
converged: YES YES NO NO
title: Mulliken charges:
elementType: N N N C C C C C C C C C C C C C C C C C H H H H H H H H H H H H H H H H H H H H H H H H H H H H H H H
charge: -0.104343 -0.080261 -0.083839 -0.402008 -0.448039 -0.374169 -0.373066 -0.330036 -0.307981 -0.386158 0.195549 -0.360579 -0.488786 -0.702537 -0.687864 -0.694222 0.461464 -0.360386 -0.338611 -0.806137 0.255364 0.205438 0.221782 0.218613 0.179141 0.258233 0.201719 0.222289 0.186029 0.186026 0.181496 0.199599 0.215585 0.224074 0.198895 0.199471 0.231461 0.208305 0.215993 0.229077 0.214260 0.216287 0.225495 0.210032 0.217706 0.210249 0.226721 0.226026 0.232395 0.222144 0.232105
chargesum: 0.00000
title: Mulliken charges with hydrogens summed into heavy atoms:
elementType: N N N C C C C C C C C C C C C C C C C C
charge: -0.104343 -0.080261 -0.083839 0.058794 -0.007644 0.063205 0.050941 0.042019 0.073115 0.053501 0.195549 0.037786 -0.257325 -0.049162 -0.031821 -0.056235 0.461464 -0.133665 -0.112585 -0.119493
polarizability: 2.37720503e+02 -1.58596569e+01 2.54050940e+02 -1.21651584e+01 -5.24035439e+00 1.49558284e+02
1716.lowfreq: -8.6038 -6.4710 -2.6013 0.0002 0.0005 0.0008 15.5069 17.9054 28.9955
frequency: 15.2888 17.6903 28.9647 34.0105 45.8591 53.9387 55.5701 58.5931 79.4048 89.4759 93.2007 127.4420 137.9359 158.8413 174.7401 189.6375 213.2418 218.1732 226.5573 240.3585 246.6593 267.5024 286.4799 315.6638 347.3860 362.9772 381.0908 407.7299 438.8711 458.5777 473.1069 486.1411 511.1456 572.4378 588.2248 605.9947 727.4301 731.3414 740.6499 750.3194 757.0670 772.2028 774.9202 802.4732 806.5854 837.5391 852.9053 867.0344 892.1393 896.3896 944.3846 949.5425 958.8500 973.2528 982.5677 1000.3276 1020.5169 1025.6888 1042.6385 1045.3903 1055.2445 1063.6751 1073.3014 1074.6044 1083.4230 1098.2823 1112.0354 1115.1562 1134.8055 1170.8767 1193.1636 1204.4088 1214.3384 1227.0811 1244.1824 1256.8672 1270.9341 1279.8673 1286.1958 1292.7495 1295.9792 1309.1695 1316.3458 1319.9999 1334.1494 1336.1885 1343.1572 1350.7627 1357.5585 1360.0422 1366.6724 1371.0608 1379.0352 1385.0140 1389.4401 1394.4936 1438.0814 1444.7269 1458.1328 1464.1899 1465.5191 1466.5723 1466.8042 1468.6088 1472.1637 1474.7856 1478.5476 1478.5953 1480.6431 1483.3858 1487.3452 1489.1990 1497.6223 1506.6297 1547.7980 1604.3434 2842.2231 2871.7762 2949.8287 2968.0357 2970.6941 2972.4448 2974.7889 2977.7445 2981.3301 2982.7101 2990.8660 2991.0988 3002.6319 3006.4268 3015.1926 3025.6665 3037.7216 3048.7700 3052.2163 3058.4768 3069.3237 3070.0930 3072.2108 3075.2569 3078.5436 3084.3029 3087.8890 3095.4398 3114.2088 3149.3197 3154.1565
redmass: 3.3926 3.5692 3.4498 3.8611 3.6583 1.4025 1.6141 1.5417 2.7018 2.7831 3.0724 3.2136 1.9127 1.5750 3.0657 3.1788 3.2514 1.2305 2.6658 1.1149 2.3467 1.9382 1.9048 3.1071 3.1086 2.8466 2.4735 2.5274 2.8816 3.1492 2.7848 2.7143 5.6405 3.3910 3.6748 3.8496 1.1370 3.1012 3.1767 2.4029 1.2889 1.1304 1.3039 1.1819 1.3373 1.2296 1.4606 3.7299 1.9926 1.9935 3.1201 1.3875 1.5599 2.4841 1.5851 3.3380 3.2737 2.3418 2.7589 1.5793 2.4117 1.7946 2.2896 2.3660 2.1218 1.6698 1.6608 2.3765 1.6864 1.7076 2.0948 2.0630 2.2269 1.9335 1.2845 1.4178 1.3477 1.2829 1.0487 1.2179 1.2531 1.3424 1.4060 1.3320 3.1602 1.4458 1.2253 1.5865 1.3871 2.1733 1.3728 1.2723 1.2590 1.2550 1.2159 1.2330 1.3680 1.7192 1.0634 1.0946 1.2315 1.0541 1.0538 1.1426 1.0588 1.1115 1.0446 1.0559 1.0500 1.1412 1.0790 1.1323 1.0791 1.8335 5.5100 5.7019 1.0720 1.0707 1.0586 1.0591 1.0573 1.0387 1.0349 1.0368 1.0598 1.0368 1.0978 1.0601 1.0792 1.0728 1.0993 1.1034 1.1017 1.1049 1.0884 1.0974 1.1009 1.0989 1.0992 1.0998 1.1003 1.0992 1.1004 1.1001 1.0883 1.0916 1.0957
irintensity: 0.1147 0.0481 0.4987 0.2965 0.5524 0.6606 0.0997 0.0041 0.5106 0.0393 0.2426 0.8229 0.0025 0.9130 1.4046 0.1419 0.4423 0.2360 2.2479 0.0566 2.4908 1.3689 1.1741 1.0296 5.8787 2.9343 0.8612 1.6188 11.9021 6.3182 3.7876 11.1883 3.5094 1.7850 4.8905 6.6853 8.9183 3.0609 0.5378 3.3811 1.9300 6.4543 7.8020 10.6544 50.2331 8.3172 6.3821 1.8399 6.2721 1.6088 3.3455 0.5913 7.4790 8.8441 3.1462 7.0287 10.1885 25.7310 12.3614 13.7190 2.0500 4.1991 47.3387 18.0964 13.2683 7.3159 24.3964 7.0758 40.0218 44.1987 8.8434 33.5371 2.3975 9.7865 2.3493 1.9341 5.9042 7.5336 1.6719 5.8509 34.0341 5.3122 0.9954 14.7346 28.4783 9.8023 7.1607 3.8134 33.4180 4.6647 4.7262 20.5112 13.3296 26.7073 12.4626 19.8969 50.2800 9.2778 15.4385 2.1333 2.1281 12.5556 12.8531 3.3944 5.1484 33.9613 8.5502 3.8446 3.2325 31.9215 19.7977 33.2263 3.4443 168.9099 55.3728 413.5457 85.1282 92.3800 13.4587 35.1230 2.4843 38.0017 28.9731 34.7388 96.3994 26.9294 4.4763 52.4962 22.5911 39.4229 10.1253 2.3821 10.9091 68.6320 16.5937 19.2445 90.4692 50.3531 52.0139 65.0989 51.7056 22.1366 43.2649 11.5670 24.7068 39.6654 7.8550
temp: 298.150 k
press: 1.00000 atm
elementType: 7 7 7 6 6 6 6 6 6 6 6 6 6 6 6 6 6 6 6 6 1 1 1 1 1 1 1 1 1 1 1 1 1 1 1 1 1 1 1 1 1 1 1 1 1 1 1 1 1 1 1
symmnumber: 1
zpe: 1188289.0 jmol-1
zpe.correction: 0.452595 hartree
zpe.thermalcorrener: 0.476828 hartree
zpe.thermalcorrenthalpy: 0.477772 hartree
zpe.thermalcorrgfe: 0.394530 hartree
zpe.sumelectzpe: -829.045486 hartree
zpe.sumelectthermal: -829.021253 hartree
zpe.sumelectthermalent: -829.020309 hartree
zpe.sumelectthermalfe: -829.103551 hartree
dipole: -1.4506 -1.4267 1.5710
dipole: 2.5706
quadrupole: -116.3887 -118.6080 -129.6335
quadrupole: -3.4270 -0.1403 0.5846
quadrupole: 5.1547 2.9354 -8.0901 -3.4270 -0.1403 0.5846
hfenergy: -829.4980811 hartree
pointgroup: C01 [X(C17H31N3)]
dipole: -0.5201341 0.6483405 -0.5761313 debye
polarizability: 241.0578718|16.3879783|251.3213641|11.820579|-0.448303|148.9504909 unknown
InChI: InChI=1S/C17H31N3/c1-5-8-9-12-20(14-13-19(6-2)7-3)17-15-16(4)10-11-18-17/h10-11,15H,5-9,12-14H2,1-4H3
charge 0 multiplicity 1
51 atoms
N  -0.259305 0.024103 0.027842
N  3.543992 0.310525 0.139803
N  -0.041665 -2.265192 0.527962
C  1.086626 0.236139 0.60275
C  -0.942909 1.182843 -0.571174
C  2.224024 -0.082555 -0.403861
C  -1.896424 1.928846 0.396583
C  -2.562562 3.154043 -0.267794
C  3.88645 1.726314 -0.131762
C  4.628126 -0.673025 -0.097279
C  -0.830333 -1.245227 0.040032
C  -3.5078 3.923182 0.683696
C  -2.166001 -1.492617 -0.425213
C  5.036737 2.258803 0.743593
C  5.11499 -0.820158 -1.56651
C  -4.16578 5.149521 0.01513
C  -2.684716 -2.801681 -0.408395
C  -0.56785 -3.520369 0.548962
C  -1.859176 -3.848486 0.092627
C  -4.091068 -3.093818 -0.898022
H  1.217298 -0.413287 1.482388
H  1.157552 1.289375 0.934689
H  -0.163883 1.887885 -0.921446
H  -1.498645 0.86551 -1.475412
H  2.003245 0.41388 -1.381137
H  2.204979 -1.172137 -0.582139
H  -1.32177 2.251582 1.288009
H  -2.672934 1.228478 0.76244
H  -3.134238 2.82727 -1.162345
H  -1.777246 3.846555 -0.638411
H  4.130805 1.902864 -1.211187
H  2.980341 2.327574 0.077363
H  5.488122 -0.409034 0.546722
H  4.262425 -1.652785 0.263466
H  -4.294259 3.233436 1.051938
H  -2.93752 4.24845 1.577419
H  -2.797113 -0.672617 -0.780015
H  5.169935 3.344477 0.581283
H  5.998045 1.767713 0.50802
H  4.813952 2.085442 1.811369
H  5.895224 -1.601504 -1.633576
H  5.548851 0.121451 -1.950796
H  4.284037 -1.112686 -2.234631
H  -4.767574 4.848207 -0.863157
H  -4.834845 5.681948 0.715799
H  -3.40076 5.868664 -0.33392
H  0.09439 -4.297079 0.951411
H  -2.216748 -4.882491 0.130439
H  -4.075273 -3.806794 -1.743774
H  -4.604963 -2.177391 -1.235688
H  -4.702186 -3.553348 -0.098686
