program: Gaussian 09
title: 000206196
version: EM64L-G09RevD.01
frameworkgroup: C1[X(C11H12N2O2)]
method: RPBEPBE
basis: SDD
operation: Freq
keyword: #p
keyword: freq=noraman
keyword: PBEPBE/SDD
title: #p freq=noraman PBEPBE/SDD
converged: NO YES NO NO
title: Mulliken charges:
elementType: O O N N C C C C C C C C C C C H H H H H H H H H H H H
charge: -0.314189 -0.267804 -0.374269 -0.098092 -0.333587 0.149835 0.381604 -0.334221 -0.360729 0.316333 -0.357623 -0.325709 -0.228517 -0.314762 -0.536626 0.238201 0.238183 0.249219 0.243995 0.335864 0.240952 0.253383 0.260326 0.253033 0.219787 0.245575 0.219837
chargesum: 0.00000
title: Mulliken charges with hydrogens summed into heavy atoms:
elementType: O O N N C C C C C C C C C C C
charge: -0.314189 -0.267804 -0.038405 -0.098092 0.142798 0.149835 0.381604 -0.085003 -0.116735 0.316333 -0.116671 -0.072326 0.031809 -0.061729 0.148574
polarizability: 2.14523753e+02 3.83497686e+00 1.33074336e+02 -3.37227891e-02 2.93920225e-02 6.47893585e+01
1716.lowfreq: -3.6158 0.0004 0.0008 0.0009 2.4604 6.2354 19.4233 30.6824 69.4382
frequency: 11.3327 30.6792 69.4250 91.2081 94.7335 160.5570 162.2375 239.2970 247.3513 253.6014 282.2145 362.9181 416.6829 430.2542 478.8807 513.6299 524.4530 622.1045 629.3121 667.8363 700.2329 711.0535 725.0992 735.0786 752.0528 790.9679 821.8957 826.1168 846.4594 905.3693 906.2721 952.2018 957.1519 986.7786 991.6216 1001.2326 1021.1150 1076.3523 1091.4445 1111.8075 1115.1617 1154.8349 1156.7124 1178.4321 1185.2197 1202.4820 1239.6626 1256.2661 1299.1817 1324.0699 1351.7785 1383.1523 1407.3404 1426.7685 1438.1881 1465.2831 1467.1210 1473.0503 1478.4659 1498.1848 1538.2878 1591.1191 1627.0934 2954.3181 2961.0817 3014.0530 3040.0778 3124.3277 3149.5094 3151.4348 3169.0013 3174.4580 3229.3801 3259.5728 3591.9746
redmass: 4.5917 5.2766 5.0472 3.4071 3.3825 4.6729 4.3852 1.6403 4.5623 1.7302 5.0810 5.9649 3.0409 5.1258 5.0516 2.3491 5.3790 3.2564 6.8703 5.3580 5.2396 3.5448 1.1212 1.2532 4.6241 1.3130 6.7009 1.5937 1.3550 1.3791 6.8713 1.3378 3.3698 7.1205 4.3595 3.2072 1.6111 1.5429 2.0346 1.2692 1.2592 2.0699 1.3853 1.2232 1.0630 2.9770 5.6315 1.8078 1.2980 2.2243 2.1983 5.4339 3.0824 3.7645 1.1725 3.7833 1.0497 1.1377 1.1269 2.1000 5.0119 7.7645 6.4116 1.0334 1.0554 1.1062 1.1038 1.0989 1.0870 1.0881 1.0957 1.0974 1.0920 1.1085 1.0818
irintensity: 12.7519 0.2794 3.2167 2.6416 0.4252 1.6431 10.2078 5.9222 3.8242 2.2938 14.3131 0.4954 0.0065 2.8666 1.7716 19.6681 8.8717 0.0576 0.5158 2.6086 20.2251 0.9132 95.9701 86.9810 13.6459 20.6758 7.7207 84.2400 15.8465 0.0163 7.8945 0.0009 31.2110 37.7725 10.8162 72.0171 0.1646 44.8845 21.4383 18.8797 0.1821 5.4554 0.0167 8.7050 0.7783 465.9233 4.4307 62.4098 12.4358 15.7454 31.8693 15.9767 27.9701 1.7281 23.3993 1.8244 13.4337 152.1413 13.5186 204.1400 39.1562 8.4561 1.6702 63.7119 26.1883 24.8766 52.7291 26.8946 20.6824 3.1426 11.8393 1.7649 4.2472 4.1514 60.1322
temp: 298.150 k
press: 1.00000 atm
elementType: 8 8 7 7 6 6 6 6 6 6 6 6 6 6 6 1 1 1 1 1 1 1 1 1 1 1 1
symmnumber: 1
zpe: 557914.7 jmol-1
zpe.correction: 0.212498 hartree
zpe.thermalcorrener: 0.226047 hartree
zpe.thermalcorrenthalpy: 0.226991 hartree
zpe.thermalcorrgfe: 0.169605 hartree
zpe.sumelectzpe: -685.193814 hartree
zpe.sumelectthermal: -685.180265 hartree
zpe.sumelectthermalent: -685.179321 hartree
zpe.sumelectthermalfe: -685.236707 hartree
dipole: -2.3184 0.7228 0.0068
dipole: 2.4285
quadrupole: -81.6232 -80.9053 -92.8816
quadrupole: 21.5536 -0.0016 0.0095
quadrupole: 3.5135 4.2314 -7.7449 21.5536 -0.0016 0.0095
hfenergy: -685.4063121 hartree
pointgroup: C01 [X(C11H12N2O2)]
dipole: -0.9148109 -0.2573694 0.0986974 debye
polarizability: 214.400174|-5.1715072|126.4251719|-0.8604545|-20.3646213|71.5621009 unknown
InChI: InChI=1S/C11H12N2O2/c1-14-9-2-4-10(5-3-9)15-8-11-12-6-7-13-11/h2-7,12H,8H2,1H3
charge 0 multiplicity 1
27 atoms
O  0.822523 -0.260345 0.227449
O  -4.811625 -0.166508 0.289833
N  3.452192 -0.761565 0.343561
N  4.123037 1.282394 -0.346109
C  1.617343 0.908955 -0.176837
C  3.058794 0.501978 -0.068053
C  -0.582994 -0.1251 0.206873
C  -1.269171 1.048849 -0.171325
C  -1.310729 -1.276743 0.601586
C  -3.409747 -0.074104 0.23686
C  -2.686076 1.074583 -0.156159
C  -2.712161 -1.251671 0.616506
C  4.851477 -0.796988 0.329686
C  5.247265 0.473764 -0.098482
C  -5.575498 1.021476 -0.093607
H  1.404712 1.770163 0.488459
H  1.372272 1.201272 -1.218005
H  -0.730659 1.949879 -0.47943
H  -0.761216 -2.177809 0.891526
H  2.802633 -1.504067 0.601418
H  -3.199251 1.994194 -0.452473
H  -3.291543 -2.129665 0.917508
H  5.418391 -1.679459 0.611733
H  6.255638 0.853999 -0.242789
H  -5.349911 1.878594 0.57159
H  -6.630993 0.733367 0.01866
H  -5.376402 1.307059 -1.145675
