program: Gaussian 09
title: 000212012
version: EM64L-G09RevD.01
frameworkgroup: C1[X(C17H18Cl2O)]
method: RPBEPBE
basis: SDD
operation: Freq
keyword: #p
keyword: freq=noraman
keyword: PBEPBE/SDD
title: #p freq=noraman PBEPBE/SDD
converged: YES YES NO NO
title: Mulliken charges:
elementType: Cl Cl O C C C C C C C C C C C C C C C C C H H H H H H H H H H H H H H H H H H
charge: -0.026238 -0.017348 -0.457137 0.119016 0.530944 -0.696122 -0.746661 -0.698742 -0.563945 0.356275 -0.413168 -0.723018 0.124995 -0.412152 0.545939 -0.435960 -0.379903 -0.052639 -0.199034 -0.113324 0.207627 0.223146 0.219174 0.215610 0.218679 0.215149 0.209044 0.214870 0.222038 0.231272 0.250250 0.218193 0.254319 0.215284 0.256356 0.275107 0.358306 0.253800
chargesum: 0.00000
title: Mulliken charges with hydrogens summed into heavy atoms:
elementType: Cl Cl O C C C C C C C C C C C C C C C C C
charge: -0.026238 -0.017348 -0.098831 0.119016 0.530944 -0.046174 -0.097224 -0.052790 -0.332673 0.356275 -0.162918 -0.250507 0.124995 -0.196869 0.545939 -0.179604 -0.104796 -0.052639 0.054766 -0.113324
polarizability: 2.47845909e+02 1.28900796e+01 2.14660461e+02 -3.66402186e+00 1.68077592e+01 1.51288291e+02
1716.lowfreq: -0.0021 0.0006 0.0020 4.5318 8.1615 13.7638 17.4142 20.8324 32.4146
frequency: 16.9543 20.6042 32.3619 55.5034 94.2125 101.9664 143.6848 156.5606 172.0624 188.2622 201.3858 210.3020 258.9792 265.4044 284.2911 293.5407 304.8920 309.1285 331.0660 350.2845 354.6500 359.3671 406.1589 419.8535 431.6521 435.8684 440.3493 464.8528 484.5967 505.7481 535.5071 587.6530 610.7174 650.8544 657.0747 676.9264 708.0550 736.2863 771.9945 805.4081 810.2822 831.5900 847.5841 880.9827 910.4193 914.8771 921.2933 932.9268 937.3438 942.6700 946.8327 968.6558 1001.9279 1019.8585 1027.5176 1074.7950 1114.4342 1118.5907 1142.2031 1159.4081 1180.7869 1199.4378 1205.9563 1208.8836 1217.2285 1243.3457 1255.1365 1275.1864 1304.8945 1310.7442 1370.2642 1375.3363 1377.1865 1378.6644 1387.3270 1404.2238 1417.4653 1458.2603 1460.3559 1465.5086 1468.5903 1470.9577 1480.4959 1486.7900 1495.3674 1501.7931 1569.7696 1594.6553 1606.3296 1616.1415 2971.8590 2972.5531 2977.9529 3006.0667 3063.6619 3066.7325 3068.6546 3069.1045 3077.0378 3077.9810 3081.0907 3108.4073 3118.0652 3148.2340 3150.1558 3165.0239 3170.2665 3584.4835
redmass: 7.0603 6.1761 3.2346 5.5453 4.6003 5.6585 5.4822 4.6870 7.5887 7.9176 3.7521 1.1320 1.1247 3.2872 3.4745 3.1864 3.8391 1.1073 3.1192 1.7166 1.5622 3.5136 2.9475 4.8526 3.7536 4.6708 3.1154 3.7105 3.3687 2.9829 4.7285 4.0186 5.7127 5.2217 5.6658 5.3828 3.5461 4.3989 3.5906 1.4893 2.7227 1.6096 3.3617 1.5271 2.1100 2.3018 1.6053 1.6834 1.3594 1.7052 1.2988 1.3811 5.5529 1.4123 1.3823 2.3953 1.8966 2.0272 1.5338 1.2073 1.1882 2.1006 2.9703 2.0650 2.8433 2.3734 1.5614 3.0322 1.4906 1.3440 6.4471 1.2771 1.1920 5.4823 2.6642 1.2039 3.5659 2.2768 1.0505 1.0487 1.1292 1.1390 1.0694 1.0516 1.2327 1.9116 7.7258 6.6881 6.5477 6.6579 1.0349 1.0348 1.0359 1.0596 1.1024 1.1001 1.0999 1.1004 1.0985 1.0995 1.0990 1.0897 1.0899 1.0920 1.0891 1.0929 1.0970 1.0660
irintensity: 0.0678 0.2890 0.0152 0.0298 0.4702 0.1858 0.4308 2.3866 0.7518 0.2784 0.3498 0.1574 0.0669 3.2881 0.1919 0.3838 2.3473 0.3719 2.3052 31.9384 94.6572 3.9819 4.0880 3.9283 1.3319 6.4178 5.6528 16.5972 5.0419 3.8330 1.3345 15.5901 4.4904 4.7573 15.6626 7.6745 9.3008 8.9076 3.0849 35.0731 32.0147 21.9827 23.3885 10.3837 6.7469 5.3482 6.9136 4.2843 0.4122 7.4488 2.5979 1.8662 31.5640 0.6506 0.0376 110.6264 71.0362 37.5270 15.2399 29.1948 2.3435 2.4201 6.3097 4.5497 2.2338 18.4510 1.8759 78.5244 0.5588 10.9075 1.3086 21.5661 18.8150 22.4802 26.6442 8.0877 3.4531 88.5383 0.0292 0.5262 16.9146 14.6522 15.2466 11.4404 0.3731 95.0915 18.3592 7.8989 0.2645 4.8754 31.7075 32.2662 27.8645 21.9682 4.9356 3.9186 6.7226 20.1362 114.7067 35.5268 49.4046 22.7045 11.6629 2.3546 0.6030 11.7687 2.5651 34.0466
temp: 298.150 k
press: 1.00000 atm
elementType: 17 17 8 6 6 6 6 6 6 6 6 6 6 6 6 6 6 6 6 6 1 1 1 1 1 1 1 1 1 1 1 1 1 1 1 1 1 1
symmnumber: 1
zpe: 789557.0 jmol-1
zpe.correction: 0.300726 hartree
zpe.thermalcorrener: 0.320730 hartree
zpe.thermalcorrenthalpy: 0.321674 hartree
zpe.thermalcorrgfe: 0.250522 hartree
zpe.sumelectzpe: -1652.494862 hartree
zpe.sumelectthermal: -1652.474858 hartree
zpe.sumelectthermalent: -1652.473914 hartree
zpe.sumelectthermalfe: -1652.545066 hartree
dipole: 4.7226 2.3670 0.2245
dipole: 5.2874
quadrupole: -141.0598 -119.2510 -131.9544
quadrupole: -1.2772 3.8268 6.2354
quadrupole: -10.3047 11.5041 -1.1993 -1.2772 3.8268 6.2354
hfenergy: -1652.795588 hartree
pointgroup: C01 [X(C17H18Cl2O1)]
dipole: 1.7462678 1.1120442 -0.2028904 debye
polarizability: 242.3884922|16.3982679|219.835883|-17.0309657|8.5893225|151.5702858 unknown
InChI: InChI=1S/C17H18Cl2O/c1-17(2,3)13-5-7-16(20)12(10-13)8-11-4-6-14(18)15(19)9-11/h4-7,9-10,20H,8H2,1-3H3
charge 0 multiplicity 1
38 atoms
Cl -4.277596 -2.840236 -0.085701
Cl -5.27771 -0.732365 2.245168
O  0.266735 3.303104 -0.662344
C  3.608912 -1.382071 0.158583
C  2.759299 -0.105009 -0.046393
C  2.816731 -2.391848 1.043309
C  4.960802 -1.082763 0.855938
C  3.909348 -2.036834 -1.223707
C  1.494994 -0.188785 -0.690397
C  0.66305 0.930661 -0.908295
C  3.181555 1.177005 0.383623
C  -0.687211 0.790556 -1.609268
C  1.121328 2.194097 -0.451799
C  2.373684 2.318663 0.185052
C  -1.824844 0.407595 -0.662131
C  -2.459823 -0.852199 -0.771961
C  -2.265592 1.305851 0.345451
C  -3.505421 -1.208665 0.105931
C  -3.311932 0.951133 1.21975
C  -3.934451 -0.310519 1.102585
H  3.399338 -3.322642 1.178802
H  2.610033 -1.962959 2.040918
H  1.84798 -2.661467 0.586011
H  4.814938 -0.646662 1.861535
H  5.528383 -2.023229 0.979413
H  5.585447 -0.3907 0.260995
H  4.508887 -2.956762 -1.088015
H  2.981175 -2.313909 -1.754819
H  4.47722 -1.344683 -1.872145
H  1.132585 -1.163189 -1.042343
H  4.147329 1.302312 0.880851
H  -0.601887 0.027305 -2.404015
H  -0.932115 1.751482 -2.096582
H  2.722935 3.30116 0.530234
H  -2.149177 -1.565574 -1.542377
H  -1.785986 2.285781 0.435658
H  0.710681 4.140914 -0.381232
H  -3.654323 1.644148 1.99412
