program: Gaussian 09
title: 000212003
version: EM64L-G09RevD.01
frameworkgroup: C1[X(C11H12N2OS)]
method: RPBEPBE
basis: SDD
operation: Freq
keyword: #p
keyword: freq=noraman
keyword: PBEPBE/SDD
title: #p freq=noraman PBEPBE/SDD
converged: YES YES NO NO
title: Mulliken charges:
elementType: S O N N C C C C C C C C C C C H H H H H H H H H H H H
charge: 0.252296 -0.307238 -0.372539 -0.648893 0.536080 -0.541518 0.390720 -0.389984 -0.395197 -0.776269 -0.391507 -0.263189 -0.242984 -0.239530 0.271735 0.213012 0.251200 0.260726 0.227947 0.281856 0.237601 0.244232 0.301804 0.227819 0.230536 0.302426 0.338859
chargesum: 0.00000
title: Mulliken charges with hydrogens summed into heavy atoms:
elementType: S O N N C C C C C C C C C C C
charge: 0.252296 -0.307238 -0.070735 -0.007609 0.536080 -0.077306 0.390720 0.098689 -0.395197 -0.494412 -0.153906 -0.018958 -0.015165 -0.008993 0.271735
polarizability: 1.88202873e+02 1.58725242e+01 1.62218058e+02 2.89774623e+01 -3.90508405e+00 9.18512300e+01
1716.lowfreq: -7.2866 -4.8740 -0.0028 -0.0013 -0.0012 1.5462 22.6310 28.1160 41.8348
frequency: 22.4961 28.0455 41.8312 82.1532 101.7674 160.7529 201.9927 234.9622 263.3963 281.9502 322.6763 371.8784 412.4320 433.5977 466.6930 479.3016 486.6877 490.0798 512.2073 523.0050 553.1826 613.0887 644.0947 681.0841 716.1230 735.9559 742.6668 762.3306 774.1138 786.8827 827.3208 863.4367 908.8209 944.6270 962.4570 983.5058 1015.7210 1021.1349 1027.4044 1044.3886 1093.8543 1133.1771 1137.3593 1167.4969 1175.7302 1198.6749 1245.3537 1265.3187 1316.0482 1322.0100 1350.8518 1374.9255 1388.1057 1428.7605 1444.9027 1456.6195 1468.7098 1501.7219 1539.1667 1573.1495 1600.5093 1602.0764 1649.8522 2991.0315 3009.9043 3063.4729 3086.9641 3127.7661 3138.3943 3151.5946 3167.4889 3220.9524 3541.2006 3554.5885 3700.0761
redmass: 6.3701 5.5647 5.1665 4.9705 4.1046 4.3035 4.6497 3.0432 3.1117 1.4426 2.3370 5.1212 2.9082 2.7643 1.3957 2.2560 5.1870 5.7515 3.8534 1.2990 4.2953 3.4146 3.4653 6.1146 8.8290 2.1883 4.9622 1.7215 3.0768 1.4988 2.6165 1.4098 2.6919 1.3858 2.1553 1.3186 2.9373 2.3662 2.3373 2.6986 2.6791 1.8073 2.1362 1.2140 1.1852 1.3255 1.3174 1.4666 1.6905 1.3120 2.0072 1.6581 5.9852 2.6251 1.1250 2.9029 1.1190 2.1184 6.0360 7.0070 1.3462 6.4187 3.5028 1.0631 1.0631 1.0977 1.1024 1.0857 1.0889 1.0949 1.1004 1.0958 1.0485 1.0742 1.1038
irintensity: 3.8393 3.1468 11.4317 3.5597 8.3167 0.4068 4.4917 4.9600 4.3185 7.8577 12.5402 2.1493 14.9590 10.3994 316.0644 75.3180 9.8194 2.8811 0.4033 37.2640 4.1375 6.3722 1.3044 7.2700 24.8192 31.4637 2.9851 40.9944 38.8622 26.3599 12.2790 1.3969 4.1382 1.2341 5.9026 0.0213 14.0610 10.2236 0.7168 20.2872 6.5522 13.1436 15.1219 1.0903 1.7995 2.4059 1.9934 3.4875 87.6544 110.9002 17.5261 6.6232 5.0313 23.5331 42.2925 8.3214 13.9499 398.3717 1.5840 0.4890 104.5321 3.1757 280.9153 25.6692 29.4848 15.6709 10.1414 2.4262 5.5877 22.3423 24.8730 1.7608 38.5161 7.5200 36.7153
temp: 298.150 k
press: 1.00000 atm
elementType: 16 8 7 7 6 6 6 6 6 6 6 6 6 6 6 1 1 1 1 1 1 1 1 1 1 1 1
symmnumber: 1
zpe: 554553.2 jmol-1
zpe.correction: 0.211218 hartree
zpe.thermalcorrener: 0.225311 hartree
zpe.thermalcorrenthalpy: 0.226255 hartree
zpe.thermalcorrgfe: 0.168103 hartree
zpe.sumelectzpe: -1008.102110 hartree
zpe.sumelectthermal: -1008.088017 hartree
zpe.sumelectthermalent: -1008.087073 hartree
zpe.sumelectthermalfe: -1008.145225 hartree
dipole: -1.8749 0.9672 -2.8545
dipole: 3.5495
quadrupole: -101.2372 -89.2181 -94.6950
quadrupole: 14.1502 -6.6205 -3.3876
quadrupole: -6.1871 5.8320 0.3551 14.1502 -6.6205 -3.3876
hfenergy: -1008.3133278 hartree
pointgroup: C01 [X(C11H12N2O1S1)]
dipole: 0.7316628 0.5025653 1.0780795 debye
polarizability: 190.8516936|-12.1488975|160.9254936|28.0928496|0.7404895|90.4949735 unknown
InChI: InChI=1S/C11H12N2OS/c12-11(14)13-6-5-8-7-15-10-4-2-1-3-9(8)10/h1-4,7,13H,5-6,12H2
charge 0 multiplicity 1
27 atoms
S  1.320601 2.521446 -0.422559
O  -4.417893 -0.767344 -0.370916
N  -2.433606 -0.359222 0.807389
N  -4.33973 0.974593 1.181417
C  0.100069 0.163369 -0.842217
C  -0.952452 -0.872085 -1.172198
C  1.421256 -0.162748 -0.304412
C  -1.6915 -1.403805 0.095403
C  2.214895 0.994069 -0.018116
C  -0.094638 1.525132 -0.954456
C  1.983095 -1.445734 -0.054139
C  3.521725 0.901035 0.501282
C  3.287032 -1.549476 0.464993
C  4.053248 -0.383879 0.743452
C  -3.765963 -0.092593 0.48549
H  -0.490763 -1.734132 -1.692823
H  -1.7134 -0.452783 -1.853668
H  -2.423247 -2.168488 -0.215488
H  -0.970342 -1.867359 0.793419
H  -0.973791 2.043631 -1.335769
H  1.403646 -2.349557 -0.274149
H  4.114081 1.797556 0.710948
H  -1.898898 0.307599 1.365536
H  3.72028 -2.537418 0.655114
H  5.067108 -0.481968 1.146255
H  -3.879464 1.463167 1.946357
H  -5.313848 1.180893 0.977058
