program: Gaussian 09
title: 000015449
version: EM64L-G09RevD.01
frameworkgroup: C1[X(C13H28O)]
method: RPBEPBE
basis: SDD
operation: Freq
keyword: #pfreq=noraman
keyword: PBEPBE/SDD
title: #p freq=noraman PBEPBE/SDD
converged: YES YES NO NO
title: Mulliken charges:
elementType: O C C C C C C C C C C C C C H H H H H H H H H H H H H H H H H H H H H H H H H H H H
charge: -0.463871 -0.385151 -0.387053 -0.384774 -0.382287 -0.381640 -0.371787 -0.372919 -0.386111 -0.353109 -0.033694 -0.356906 -0.718365 -0.696879 0.193627 0.191577 0.196723 0.191299 0.191939 0.193619 0.185480 0.195284 0.192003 0.190913 0.177070 0.236054 0.188669 0.189660 0.187422 0.208365 0.187722 0.187021 0.180597 0.194429 0.194911 0.231197 0.214338 0.205102 0.209644 0.214559 0.209459 0.335860
chargesum: 0.00000
title: Mulliken charges with hydrogens summed into heavy atoms:
elementType: O C C C C C C C C C C C C C
charge: -0.128010 0.000053 0.000970 0.000784 -0.001523 0.001276 0.041337 0.005411 0.009676 0.021634 0.146903 0.032434 -0.067729 -0.063217
polarizability: 1.94339339e+02 2.43821209e-01 1.28121052e+02 1.09992616e+00 3.77246240e-01 1.20461853e+02
1716.lowfreq: -8.0077 -0.0010 -0.0006 0.0013 6.9910 16.6323 18.9801 31.3731 34.2866
frequency: 18.0332 31.1868 33.9835 48.4341 67.1589 79.4168 85.9732 103.4037 123.3053 134.8897 147.1388 152.1455 156.7648 162.8955 218.4661 230.1231 231.6291 289.4604 298.4494 316.7705 388.6426 395.8699 451.7321 458.8573 492.0164 507.5318 720.1890 721.9748 727.0821 739.7724 764.8142 796.3475 820.7537 860.8016 888.1852 909.2800 919.1643 966.4359 979.6747 995.5723 1005.2862 1012.1249 1032.5477 1044.0271 1050.1720 1069.1416 1076.9615 1080.3467 1082.1756 1083.9212 1105.3404 1128.2831 1134.6389 1181.7828 1202.7732 1206.1414 1227.5320 1235.6706 1249.1492 1262.3109 1268.5944 1279.2385 1283.2295 1287.4830 1288.8185 1293.3845 1297.7370 1298.9882 1311.4381 1324.3848 1339.7583 1352.4246 1355.0186 1357.8532 1359.4815 1383.5865 1385.7123 1387.7836 1444.5159 1458.9453 1459.0640 1462.6285 1462.6986 1466.4023 1466.8912 1469.9379 1471.3850 1476.7756 1477.0498 1481.8775 1485.9113 1488.1782 2925.2655 2947.0179 2948.1804 2949.0098 2950.2019 2952.2885 2956.2582 2959.7159 2962.9591 2967.5324 2970.0841 2971.3807 2973.9130 2981.2436 2984.3653 2989.5227 2997.0266 3007.5441 3018.9616 3024.8002 3032.0431 3040.9877 3054.4182 3061.2795 3068.0625 3070.1864 3083.1052 3557.7048
redmass: 3.1504 2.9804 2.5503 3.2099 1.7147 3.6138 2.8607 1.7095 2.5201 1.8448 3.2129 2.1539 2.3931 2.9644 1.2752 1.1529 2.0583 1.3754 2.1086 2.9996 3.1611 2.8985 2.4664 3.1692 2.6546 2.9821 1.0581 1.0679 1.0910 1.1434 1.2434 1.6373 1.6249 1.2644 1.9034 1.5167 1.4977 1.2584 5.3908 3.4113 1.4092 3.5143 1.1744 3.0691 2.6795 2.6528 1.7126 2.1211 2.1615 2.1911 2.2671 2.8766 1.7569 1.8644 1.5084 1.3178 1.3825 1.3057 1.3057 1.2840 1.2612 1.0173 1.1500 1.0780 1.2753 1.1026 1.1293 1.1108 1.3096 1.3108 1.3958 1.5066 1.6972 1.6447 1.6027 1.4585 1.4084 1.2180 1.0863 1.0733 1.0741 1.0683 1.0695 1.0768 1.0532 1.0682 1.0819 1.0844 1.0431 1.0898 1.0939 1.0923 1.0837 1.0588 1.0585 1.0590 1.0591 1.0596 1.0606 1.0632 1.0599 1.0586 1.0424 1.0364 1.0547 1.0959 1.0966 1.0982 1.1005 1.1024 1.1018 1.1000 1.1049 1.1046 1.1020 1.0982 1.1006 1.0993 1.0997 1.0661
irintensity: 0.1748 0.5783 0.1941 0.4623 0.5502 0.2743 0.5344 0.8139 0.5327 0.9658 0.4748 0.0292 0.2098 0.6003 0.2973 0.0119 0.2598 91.8435 58.2852 0.8639 5.4253 1.8748 6.6547 2.3358 2.4132 0.2325 18.9613 0.0682 4.3777 1.2559 1.1315 11.6516 5.4640 0.5919 5.3418 13.3762 2.1096 1.7075 1.8653 1.3354 13.1333 1.6121 2.3404 0.6675 10.9161 2.9417 47.4524 0.6295 5.3893 0.3520 22.3737 9.9290 2.8839 0.5877 5.2584 16.3274 7.4847 1.1313 10.1051 0.8287 5.3062 0.3493 2.0151 0.7133 1.1961 0.5354 0.2690 0.5034 4.0006 6.0333 1.1229 2.1455 0.0404 0.2124 0.5035 33.7783 3.2454 11.0221 2.8293 0.0005 0.0231 0.0285 0.0306 0.0507 10.2871 7.0864 1.0380 2.1011 12.0128 1.5507 6.4231 35.5684 54.3407 2.9475 0.4931 0.6429 0.1849 2.9436 1.5118 2.8849 113.7677 179.1854 31.4643 37.2139 67.0412 1.9157 3.0022 3.1741 2.7268 2.4431 13.9650 5.2420 0.3873 192.7026 110.7174 54.5900 98.3746 56.5802 46.9606 4.3311
temp: 298.150 k
press: 1.00000 atm
elementType: 8 6 6 6 6 6 6 6 6 6 6 6 6 6 1 1 1 1 1 1 1 1 1 1 1 1 1 1 1 1 1 1 1 1 1 1 1 1 1 1 1 1
symmnumber: 1
zpe: 1009270.7 jmol-1
zpe.correction: 0.384411 hartree
zpe.thermalcorrener: 0.403841 hartree
zpe.thermalcorrenthalpy: 0.404786 hartree
zpe.thermalcorrgfe: 0.333945 hartree
zpe.sumelectzpe: -586.205581 hartree
zpe.sumelectthermal: -586.186150 hartree
zpe.sumelectthermalent: -586.185206 hartree
zpe.sumelectthermalfe: -586.256046 hartree
dipole: 1.4506 -0.4426 1.1320
dipole: 1.8925
quadrupole: -76.7889 -91.7311 -91.7317
quadrupole: -0.4217 6.2141 0.2616
quadrupole: 9.9616 -4.9805 -4.9811 -0.4217 6.2141 0.2616
hfenergy: -586.5899916 hartree
pointgroup: C01 [X(C13H28O1)]
dipole: -0.5707738 -0.1574188 -0.4514805 debye
polarizability: 194.3410452|-0.2064265|128.1381796|1.0513816|-0.077691|120.443019 unknown
InChI: InChI=1S/C13H28O/c1-3-4-5-6-7-8-9-10-11-12-13(2)14/h13-14H,3-12H2,1-2H3
charge 0 multiplicity 1
42 atoms
O  -5.998226 1.284249 0.689487
C  0.468754 -0.462056 0.1048
C  -0.841507 0.280911 -0.239945
C  1.739956 0.361897 -0.200154
C  -2.112993 -0.542366 0.065263
C  3.050148 -0.383041 0.141352
C  -3.419425 0.208386 -0.274974
C  4.322076 0.439263 -0.165632
C  -4.686612 -0.621361 0.022743
C  5.631999 -0.309368 0.168612
C  -5.992862 0.139849 -0.254933
C  6.904564 0.512123 -0.139955
C  -7.248125 -0.730196 -0.062068
C  8.207948 -0.247335 0.19008
H  0.460645 -0.738176 1.180272
H  0.507297 -1.417341 -0.460009
H  -0.880989 1.235862 0.324529
H  -0.833317 0.556951 -1.315548
H  1.74692 0.640158 -1.27513
H  1.702814 1.315902 0.366525
H  -2.075074 -1.4976 -0.500625
H  -2.119891 -0.818965 1.140571
H  3.043911 -0.660252 1.216531
H  3.085873 -1.337736 -0.424447
H  -3.409252 0.490079 -1.349649
H  -3.473048 1.152686 0.298965
H  4.325569 0.72079 -1.239819
H  4.289142 1.391764 0.404009
H  -4.682459 -1.547915 -0.586867
H  -4.690473 -0.930023 1.087528
H  5.63064 -0.590654 1.24283
H  5.665528 -1.26204 -0.400769
H  -5.969925 0.529335 -1.298861
H  6.902573 0.796983 -1.212145
H  6.872926 1.461565 0.432898
H  -7.29345 -1.109285 0.974948
H  -7.23922 -1.595688 -0.750695
H  -8.173716 -0.155326 -0.260229
H  8.24742 -0.518433 1.262197
H  9.10234 0.361588 -0.037655
H  8.278525 -1.184179 -0.394409
H  -6.836502 1.797694 0.565178
