program: Gaussian 09
title: 000206174
version: EM64L-G09RevD.01
frameworkgroup: C1[X(C16H14O3S)]
method: RPBEPBE
basis: SDD
operation: Freq
keyword: #p
keyword: freq=noraman
keyword: PBEPBE/SDD
title: #p freq=noraman PBEPBE/SDD
converged: NO YES NO NO
title: Mulliken charges:
elementType: S O O O C C C C C C C C C C C C C C C C H H H H H H H H H H H H H H
charge: 0.654000 -0.606593 -0.407357 -0.227505 -0.772290 0.592985 0.404943 -0.401422 0.339885 -0.856782 -0.606334 0.462591 -0.225844 -0.413333 -0.375866 -0.369210 -0.626993 -0.239235 -0.244822 0.210952 0.236130 0.247658 0.281350 0.316308 0.247874 0.305287 0.227785 0.238798 0.266743 0.249991 0.242306 0.233533 0.235102 0.379363
chargesum: 0.00000
title: Mulliken charges with hydrogens summed into heavy atoms:
elementType: S O O O C C C C C C C C C C C C C C C C
charge: 0.654000 -0.606593 -0.027995 -0.227505 -0.288502 0.592985 0.404943 -0.401422 0.339885 -0.259125 -0.358460 0.462591 0.079443 -0.185547 -0.137067 -0.102467 -0.134695 -0.005702 -0.009720 0.210952
polarizability: 2.41041941e+02 -2.31341346e+01 2.16527660e+02 -1.58253866e+01 -2.07657777e+01 1.42138166e+02
1716.lowfreq: -2.5742 0.0012 0.0016 0.0018 5.6517 9.9216 10.7382 28.3918 32.3685
frequency: 9.6173 28.3655 32.3343 50.1393 87.7356 120.4817 147.4985 151.1488 189.7469 207.3047 231.0789 251.7982 257.0518 272.9672 322.4913 361.3649 377.1948 403.5845 428.3307 435.1893 445.3996 490.5261 508.2688 536.8842 554.5920 570.1847 600.4290 623.5703 643.1469 656.2081 700.8360 713.8935 725.4731 753.5068 758.6990 786.9147 799.8463 833.6583 845.6103 862.4908 877.7502 893.3131 904.9097 906.6960 929.8458 953.9952 965.8386 988.8986 990.6888 1013.4817 1052.4626 1059.5507 1098.8805 1140.4883 1145.1539 1150.2134 1176.6610 1180.1564 1184.1446 1188.1646 1217.9629 1238.4958 1246.7417 1274.5926 1276.8711 1287.2337 1320.4713 1332.3706 1371.0233 1390.8703 1414.3170 1416.5304 1432.4825 1453.8853 1461.2046 1468.4856 1486.2093 1583.0431 1590.6810 1604.0930 1610.0933 1664.8709 2957.6485 3022.6966 3027.3848 3046.5347 3101.0481 3104.6257 3120.2124 3121.8221 3123.7476 3124.7813 3143.3569 3149.9182 3164.8279 3506.8925
redmass: 6.4853 9.5433 4.6993 5.7022 5.5016 5.3063 4.7763 4.6475 8.4472 5.8961 3.8329 3.5229 5.0829 7.4166 4.0318 4.6576 3.9687 2.8851 3.1156 3.2329 3.1965 3.5978 4.0687 3.9786 4.5847 4.4003 5.8848 3.7757 2.8078 2.2195 4.1540 4.8432 3.3058 1.9807 2.0003 3.3084 13.5411 2.6197 3.2029 1.4081 1.7942 1.7942 1.9187 2.4879 1.9544 1.6139 1.9948 1.3968 1.3408 6.0101 2.4558 1.9538 2.1789 1.4403 1.2278 1.7527 1.1870 1.1559 1.5207 1.5385 1.5731 2.5487 1.4947 1.4515 1.3691 1.4790 2.1638 1.6048 5.3029 4.9950 1.6868 1.8145 1.9638 1.2398 1.2144 1.8703 2.1208 6.6022 6.2663 6.4904 7.1044 8.5846 1.0670 1.0576 1.0608 1.0925 1.1068 1.1020 1.0864 1.0914 1.0892 1.0893 1.0931 1.0956 1.1009 1.0639
irintensity: 0.1065 2.2422 0.1091 0.3268 1.0460 1.0435 4.7132 2.2725 7.9291 1.7467 3.5580 6.2021 3.4639 0.0910 0.2691 10.6408 5.7033 5.2112 5.6619 0.2317 1.1073 12.4723 14.3523 16.2299 10.3846 37.1541 2.3669 20.7586 51.5309 89.2472 5.4843 15.1090 0.2967 20.6551 46.1572 11.7987 48.0818 39.1289 9.0760 3.7277 9.5867 8.8854 3.2913 10.7478 12.1644 3.3698 18.5415 3.7979 0.0309 2.6661 4.2522 197.1185 8.9308 23.5278 1.7904 0.7675 5.7262 13.2109 3.4243 4.6419 3.0780 12.1916 2.8692 2.0202 1.2920 2.7733 71.3360 5.3838 1.0282 6.3104 4.1289 15.0228 15.4402 20.8507 27.4651 18.2428 28.6327 4.6190 5.0594 3.1437 6.7724 216.8906 13.1511 5.0394 11.3829 14.2237 2.9379 3.2836 7.3645 6.9879 10.1715 1.5382 23.3173 7.6748 30.7731 22.9752
temp: 298.150 k
press: 1.00000 atm
elementType: 16 8 8 8 6 6 6 6 6 6 6 6 6 6 6 6 6 6 6 6 1 1 1 1 1 1 1 1 1 1 1 1 1 1
symmnumber: 1
zpe: 678491.3 jmol-1
zpe.correction: 0.258424 hartree
zpe.thermalcorrener: 0.276085 hartree
zpe.thermalcorrenthalpy: 0.277029 hartree
zpe.thermalcorrgfe: 0.209988 hartree
zpe.sumelectzpe: -1240.352498 hartree
zpe.sumelectthermal: -1240.334837 hartree
zpe.sumelectthermalent: -1240.333892 hartree
zpe.sumelectthermalfe: -1240.400934 hartree
dipole: 0.9871 -5.8744 1.7347
dipole: 6.2042
quadrupole: -117.1245 -135.6142 -118.0906
quadrupole: -2.0269 -7.0052 3.7172
quadrupole: 6.4852 -12.0044 5.5192 -2.0269 -7.0052 3.7172
hfenergy: -1240.6109216 hartree
pointgroup: C01 [X(C16H14O3S1)]
dipole: -0.3343687 2.2409154 0.9080259 debye
polarizability: 240.9797573|-24.2514283|212.6134838|11.5929337|27.8581486|146.1145255 unknown
InChI: InChI=1S/C16H14O3S/c17-16(18)8-11-5-6-15-14(7-11)9-12-3-1-2-4-13(12)10-20(15)19/h1-7,17H,8-10H2
charge 0 multiplicity 1
34 atoms
S  -1.448909 -2.538932 0.074836
O  -1.053766 -3.771062 -0.987812
O  4.181292 2.310729 -0.80348
O  5.035177 0.266431 -1.505311
C  -1.076898 0.169845 1.617873
C  0.201281 -0.390523 1.003277
C  -2.133605 0.781201 0.681715
C  0.199077 -1.622114 0.319656
C  -2.663393 0.138259 -0.482222
C  -2.123134 -1.127216 -1.116528
C  1.44742 0.272351 1.120058
C  2.631726 -0.285057 0.576475
C  1.342827 -2.206364 -0.238157
C  -2.685947 2.027883 1.074931
C  -3.746123 0.753222 -1.170147
C  2.574123 -1.527773 -0.104592
C  3.965444 0.451556 0.721658
C  -3.740879 2.640721 0.366843
C  -4.283246 1.991657 -0.762668
C  4.463479 0.948773 -0.628664
H  -0.80196 0.939094 2.36094
H  -1.567007 -0.642781 2.195321
H  -2.892516 -1.66164 -1.69815
H  -1.245446 -0.95014 -1.761517
H  1.491918 1.238416 1.638377
H  1.239318 -3.159647 -0.771843
H  -2.281453 2.524556 1.965248
H  -4.163126 0.251329 -2.051754
H  3.487264 -1.953425 -0.535427
H  4.734365 -0.234674 1.118378
H  3.863981 1.307789 1.406008
H  -4.138592 3.60564 0.699173
H  -5.112812 2.439795 -1.319867
H  4.481019 2.596404 -1.709627
