program: Gaussian 09
title: 000206173
version: EM64L-G09RevD.01
frameworkgroup: C1[X(C16H14O2S)]
method: RPBEPBE
basis: SDD
operation: Freq
keyword: #p
keyword: freq=noraman
keyword: PBEPBE/SDD
title: #p freq=noraman PBEPBE/SDD
converged: YES YES NO NO
title: Mulliken charges:
elementType: S O O C C C C C C C C C C C C C C C C H H H H H H H H H H H H H H
charge: 0.164874 -0.405955 -0.238613 -0.751695 0.618657 0.374549 0.419045 -0.391239 -0.891501 -0.556282 0.469616 -0.390518 -0.230917 -0.414391 -0.442537 -0.625640 -0.238579 -0.233864 0.214767 0.235077 0.234119 0.275562 0.272033 0.255609 0.236703 0.247205 0.234173 0.238265 0.245830 0.241819 0.228345 0.229118 0.376364
chargesum: 0.00000
title: Mulliken charges with hydrogens summed into heavy atoms:
elementType: S O O C C C C C C C C C C C C C C C C
charge: 0.164874 -0.029591 -0.238613 -0.282499 0.618657 0.374549 0.419045 -0.391239 -0.343905 -0.300673 0.469616 -0.153814 0.016288 -0.180218 -0.204272 -0.137992 -0.010234 -0.004746 0.214767
polarizability: 2.39212449e+02 -1.15119985e+00 1.99223073e+02 -1.03640817e+01 8.88359228e+00 1.36492844e+02
1716.lowfreq: -11.1535 -6.2065 -0.0013 -0.0012 -0.0006 4.0791 15.9892 23.6244 34.8500
frequency: 15.6210 23.5287 34.8443 61.0747 73.9751 118.7606 131.6213 183.9913 200.6323 259.7606 305.2576 324.4436 326.1976 349.9157 375.1676 402.9190 431.7259 443.7997 456.7209 489.9904 515.2239 535.9569 557.2838 576.2850 592.7712 626.2833 637.5674 649.7409 697.7035 713.5416 745.2406 760.6852 767.0799 788.8644 818.0061 838.2056 859.2881 882.7974 892.8888 912.5628 925.3141 927.6145 952.2131 953.7822 962.5735 989.5612 1027.8119 1040.8208 1061.5545 1086.0166 1131.9657 1150.6073 1163.1220 1166.9622 1175.7203 1181.8997 1190.6337 1228.2104 1237.8617 1250.7728 1268.4552 1277.6148 1295.9225 1309.5416 1323.3327 1375.2495 1385.0814 1409.2720 1438.6745 1454.3180 1455.1448 1468.9093 1482.1081 1484.2215 1574.7961 1590.2231 1604.3197 1613.4729 1659.7379 2993.5494 3018.4383 3029.4367 3060.5757 3097.1214 3102.7985 3120.3842 3125.3973 3126.7038 3127.6413 3141.6786 3149.8045 3162.4890 3505.9388
redmass: 5.4784 5.8743 9.4506 7.0879 4.6562 6.5016 3.9419 4.5696 4.8550 6.2471 4.6617 4.9087 4.3312 4.7851 2.7000 2.3342 3.1071 3.7983 2.8322 3.5494 3.9916 3.3671 4.7333 4.2258 5.4874 3.8514 4.1167 1.8225 4.2652 4.4246 2.7865 4.2593 1.7679 2.4981 1.7214 2.6924 2.8190 1.7492 1.6607 1.9161 1.9059 2.2110 1.5186 1.4761 2.0548 1.3317 5.8941 2.3084 2.0037 1.8624 1.4418 1.2562 1.2570 1.4277 1.0585 1.2135 2.5436 2.0079 1.7750 1.6616 1.3554 1.4744 1.4257 1.5078 2.4786 4.9509 6.7446 2.9989 2.0515 1.1701 1.1627 2.0704 1.3070 2.1830 7.3680 6.6681 6.0572 6.4857 8.5059 1.0624 1.0623 1.0579 1.0993 1.1065 1.1000 1.0859 1.0900 1.0906 1.0878 1.0938 1.0971 1.1007 1.0638
irintensity: 0.8808 0.6733 3.0026 0.5165 0.3309 0.6476 0.1275 1.1793 0.7216 0.1638 2.3544 1.0123 0.7846 0.4175 0.1432 6.0171 1.1239 3.4535 7.3395 1.1465 32.4536 22.6611 10.5281 30.8536 2.7421 12.3371 57.0157 80.6301 39.4517 5.5302 26.2571 1.3154 32.2748 14.0022 35.9322 1.5675 9.7020 0.3945 2.3375 2.7712 21.4847 4.2538 5.2731 10.8976 2.6209 0.1233 65.2624 5.8399 192.7659 15.3396 15.0612 4.3444 3.4176 6.0884 0.3058 22.6552 3.4194 2.3352 5.6605 5.2034 4.6361 1.5370 1.2746 11.7066 69.2550 6.6779 0.3567 8.7824 4.7422 14.3527 18.8015 64.1503 20.5147 11.7360 4.2042 1.2179 1.0003 1.7985 189.1528 27.2537 16.5896 24.8578 11.2346 4.9850 5.0871 4.8903 4.5054 3.5625 7.8814 26.4186 13.1485 29.9031 21.3939
temp: 298.150 k
press: 1.00000 atm
elementType: 16 8 8 6 6 6 6 6 6 6 6 6 6 6 6 6 6 6 6 1 1 1 1 1 1 1 1 1 1 1 1 1 1
symmnumber: 1
zpe: 672392.8 jmol-1
zpe.correction: 0.256101 hartree
zpe.thermalcorrener: 0.272423 hartree
zpe.thermalcorrenthalpy: 0.273367 hartree
zpe.thermalcorrgfe: 0.209420 hartree
zpe.sumelectzpe: -1165.288481 hartree
zpe.sumelectthermal: -1165.272158 hartree
zpe.sumelectthermalent: -1165.271214 hartree
zpe.sumelectthermalfe: -1165.335161 hartree
dipole: 0.1516 0.6002 -0.3693
dipole: 0.7208
quadrupole: -104.3763 -117.4761 -114.9406
quadrupole: 2.7991 1.6971 -4.1225
quadrupole: 7.8881 -5.2118 -2.6763 2.7991 1.6971 -4.1225
hfenergy: -1165.5445815 hartree
pointgroup: C01 [X(C16H14O2S1)]
dipole: -0.0918803 -0.2185791 -0.1555629 debye
polarizability: 237.6702233|-7.2476123|201.1804841|10.2628047|-7.8893256|136.0776593 unknown
InChI: InChI=1S/C16H14O2S/c17-16(18)8-11-5-6-15-14(7-11)9-12-3-1-2-4-13(12)10-19-15/h1-7,17H,8-10H2
charge 0 multiplicity 1
33 atoms
S  -1.568327 2.854647 -0.109648
O  4.446722 -1.613135 -1.275079
O  3.346498 -2.470603 0.581739
C  -1.049657 0.142485 1.751162
C  0.123274 0.740899 0.976618
C  -2.024656 -0.517221 0.780452
C  -2.950453 0.28586 0.050614
C  -0.037923 1.85156 0.100789
C  -3.077273 1.75185 0.364994
C  1.400341 0.139637 1.072576
C  2.514803 0.613949 0.340427
C  -1.958642 -1.905552 0.518002
C  1.066206 2.320523 -0.653329
C  -3.773422 -0.316042 -0.933075
C  2.333231 1.714287 -0.529318
C  3.884178 -0.053619 0.482732
C  -2.793554 -2.502025 -0.453541
C  -3.701099 -1.703761 -1.186433
C  3.848962 -1.491652 -0.013138
H  -1.553274 0.933347 2.339358
H  -0.671237 -0.604941 2.469975
H  -3.890579 2.218237 -0.214618
H  -3.259352 1.932863 1.436507
H  1.524182 -0.729739 1.730043
H  -1.240599 -2.522144 1.071825
H  0.930092 3.161839 -1.341761
H  -4.47837 0.305955 -1.497736
H  3.174609 2.093127 -1.120765
H  4.181875 -0.085297 1.546731
H  4.646057 0.505576 -0.081635
H  -2.732564 -3.579766 -0.641077
H  -4.347545 -2.157505 -1.945621
H  4.367594 -2.555942 -1.587368
