program: Gaussian 09
title: 000206169
version: EM64L-G09RevD.01
frameworkgroup: C1[X(C20H25N3OS)]
method: RPBEPBE
basis: SDD
operation: Freq
keyword: #p
keyword: freq=noraman
keyword: PBEPBE/SDD
title: #p freq=noraman PBEPBE/SDD
converged: NO YES NO NO
title: Mulliken charges:
elementType: S O N N N C C C C C C C C C C C C C C C C C C C C H H H H H H H H H H H H H H H H H H H H H H H H H
charge: 0.224935 -0.451278 -0.098847 -0.069102 0.011606 -0.163587 -0.372930 -0.371150 -0.385801 -0.380418 -0.626178 0.594949 -0.320184 0.625968 -0.390066 -0.393961 -0.451392 -0.485481 -0.364818 -0.331156 -0.262324 -0.241692 -0.238895 -0.187245 -0.370173 0.196809 0.188470 0.218729 0.231043 0.187509 0.193564 0.201149 0.206742 0.194541 0.224429 0.253641 0.172252 0.194470 0.230061 0.222963 0.239694 0.239739 0.185228 0.185706 0.252761 0.231155 0.232596 0.230701 0.244052 0.341217
chargesum: 0.00000
title: Mulliken charges with hydrogens summed into heavy atoms:
elementType: S O N N N C C C C C C C C C C C C C C C C C C C C
charge: 0.224935 -0.110061 -0.098847 -0.069102 0.011606 0.033221 0.034269 0.047402 0.008912 0.020865 -0.148108 0.594949 0.046538 0.625968 0.062958 -0.393961 -0.211697 -0.485481 -0.125080 0.039777 -0.009563 -0.010537 -0.006298 0.043456 -0.126121
polarizability: 2.26312407e+02 2.50441585e+01 3.25753825e+02 7.37637518e+00 -3.15678368e+00 2.16986061e+02
1716.lowfreq: -6.7228 -0.0012 0.0010 0.0014 7.4033 9.9492 19.7686 29.1850 38.2388
frequency: 18.8751 29.0359 38.2305 48.6306 52.7013 62.4217 78.0504 103.3069 109.7045 131.3338 149.8138 178.6273 197.9101 210.4256 224.9365 244.4430 257.9249 267.2238 276.1963 281.7370 298.2608 321.7437 339.3011 358.7564 404.4405 423.8510 435.1718 441.8228 453.7376 466.9694 492.2763 496.7434 507.1544 542.9113 565.9945 602.9821 617.6810 638.7596 655.1749 684.3478 739.7936 747.2536 769.1292 770.1383 778.2642 785.4365 792.7779 804.1884 851.2536 853.0519 877.0122 879.5454 924.9266 936.9205 950.3483 954.8862 968.8604 972.9791 983.0655 986.5414 1011.1226 1023.1445 1028.7452 1035.1025 1051.1548 1051.4367 1056.4941 1064.9284 1072.6750 1090.4149 1114.4447 1122.8774 1125.9597 1132.6458 1143.0501 1148.6594 1166.4721 1172.8514 1180.3357 1185.1042 1196.8832 1208.3315 1222.1234 1232.6826 1248.2669 1252.1631 1268.5906 1273.4278 1280.0215 1286.4487 1295.1083 1303.9704 1314.5565 1324.8821 1337.8656 1345.0294 1353.3125 1358.1691 1374.2207 1378.2184 1387.9603 1399.1819 1401.8454 1415.0521 1426.5069 1426.8094 1451.1532 1453.2525 1462.2745 1467.5797 1468.3949 1471.4260 1473.1915 1478.3994 1491.0913 1542.4826 1575.0424 1580.2160 1596.8108 2814.5263 2828.8295 2850.7999 2861.5948 2865.9451 2877.5005 2924.8508 2971.7976 2989.0897 2992.0130 3008.4940 3022.9716 3036.4522 3052.0580 3057.6292 3063.6493 3076.2081 3119.2374 3119.7336 3131.9880 3136.6548 3146.1153 3165.8157 3170.0501 3565.9222
redmass: 6.1732 6.7090 4.8154 2.1627 4.8952 2.6371 4.2140 4.9009 3.6705 3.5575 4.1613 3.7013 4.4697 3.8040 3.3769 3.1905 2.5376 3.9330 1.1031 3.8861 4.2879 2.6556 4.7454 2.8486 2.0263 5.0064 5.4770 5.7432 4.1332 3.2081 3.1353 3.9247 3.7304 4.7193 4.4122 4.1934 2.5510 6.8455 5.5869 3.9046 4.6516 2.2938 1.6350 3.6695 4.2001 1.1028 1.6434 2.5513 1.6169 3.4239 1.4331 1.2399 1.5980 1.9583 1.8351 1.6478 4.4960 1.6689 2.5941 1.3423 2.6604 2.3141 5.8146 2.8846 3.0888 2.4215 2.1316 2.4830 2.3856 2.0552 2.0410 1.9352 1.9299 2.5294 2.4065 3.1247 1.8201 1.1786 1.2762 1.7176 1.2401 1.2116 1.5519 1.4973 1.3822 1.4906 1.3227 1.3263 1.2126 1.4360 1.2296 1.3060 1.3429 5.8824 1.5506 1.2709 1.4237 1.6786 1.4409 2.6003 1.6619 1.4481 1.8462 1.4508 2.2802 2.2890 1.0791 1.0808 1.1014 1.3034 1.5968 1.0838 1.1900 1.0918 1.0920 5.3176 6.3126 6.5469 6.2537 1.0813 1.0707 1.0711 1.0702 1.0700 1.0687 1.0545 1.1069 1.0608 1.0857 1.0611 1.0892 1.1010 1.0893 1.0859 1.0884 1.1038 1.0875 1.0894 1.0876 1.0901 1.0936 1.1008 1.0994 1.0664
irintensity: 0.8167 0.8419 2.2012 7.7613 0.3502 1.4560 0.3391 1.2814 1.6129 1.1938 0.9236 2.6206 0.7667 3.5420 0.2601 4.2345 0.8470 0.2613 147.0496 4.0181 1.3132 4.4558 2.5813 9.7026 2.0291 0.2700 0.0510 5.6082 4.6036 10.1529 10.8138 8.8152 0.6859 1.0600 2.5007 2.9744 1.4782 5.1800 11.3745 6.1118 1.4234 50.6281 20.2364 18.2897 21.6322 3.3180 38.5242 42.5759 1.6837 12.4480 2.2843 0.4001 4.5591 6.3653 4.0450 6.9410 87.1491 20.7565 11.9145 0.9625 18.2064 21.6439 43.8140 7.6280 24.0069 8.9852 6.5186 12.2402 4.5878 0.7703 26.3973 10.0532 17.9253 22.4681 49.4794 32.4795 5.0279 0.4912 1.5441 13.4937 3.5385 10.1121 16.1699 3.7362 3.4744 8.8409 25.9311 4.0972 7.5499 19.1416 10.0611 4.0556 17.3952 2.2381 13.4452 5.8583 6.8971 19.5484 6.7237 1.5906 3.8779 4.7249 101.8676 11.1032 8.7350 68.6541 2.3862 2.1018 22.2239 6.8520 11.3759 0.2894 35.1247 2.3612 7.4893 41.6780 39.8952 5.2717 4.1891 67.2367 70.4645 66.0095 17.2659 18.8103 232.7398 73.8335 55.6008 24.1726 21.1800 24.9398 53.5019 18.3509 40.0004 39.5272 12.3313 46.6864 4.4653 11.3112 2.9348 21.8771 16.5039 35.1209 30.7882 2.0633
temp: 298.150 k
press: 1.00000 atm
elementType: 16 8 7 7 7 6 6 6 6 6 6 6 6 6 6 6 6 6 6 6 6 6 6 6 6 1 1 1 1 1 1 1 1 1 1 1 1 1 1 1 1 1 1 1 1 1 1 1 1 1
symmnumber: 1
zpe: 1086726.4 jmol-1
zpe.correction: 0.413912 hartree
zpe.thermalcorrener: 0.437038 hartree
zpe.thermalcorrenthalpy: 0.437982 hartree
zpe.thermalcorrgfe: 0.359726 hartree
zpe.sumelectzpe: -1412.756139 hartree
zpe.sumelectthermal: -1412.733013 hartree
zpe.sumelectthermalent: -1412.732069 hartree
zpe.sumelectthermalfe: -1412.810326 hartree
dipole: 0.6780 1.5789 3.1018
dipole: 3.5459
quadrupole: -147.4963 -142.0124 -154.7073
quadrupole: 18.6715 -11.1317 5.7781
quadrupole: 0.5757 6.0595 -6.6353 18.6715 -11.1317 5.7781
hfenergy: -1413.1700512 hartree
pointgroup: C01 [X(C20H25N3O1S1)]
dipole: -0.1664845 -0.7408616 1.1703129 debye
polarizability: 220.8613049|5.9979127|330.6511532|-7.3814536|9.606776|217.5398346 unknown
InChI: InChI=1S/C20H25N3OS/c24-14-4-9-22-10-12-23(13-11-22)18-15-16-5-3-8-21-20(16)25-19-7-2-1-6-17(18)19/h1-3,5-8,18,24H,4,9-15H2
charge 0 multiplicity 1
50 atoms
S  2.120779 0.498745 -1.7580
O  -7.673714 -0.12375 -0.967468
N  -0.178501 0.122114 0.759105
N  -2.969943 -0.65954 0.417087
N  2.40981 -2.085542 -1.820733
C  1.005729 0.728259 1.428327
C  -0.785221 -0.972997 1.5591
C  -1.227432 1.113749 0.401031
C  -1.921762 -1.646561 0.774351
C  -2.364774 0.43856 -0.379115
C  2.159424 -0.318692 1.614555
C  1.525935 1.965998 0.703563
C  -4.126376 -1.302119 -0.253436
C  2.297711 -1.363402 0.522124
C  -5.354174 -0.373519 -0.355718
C  2.084979 1.930243 -0.600699
C  1.518493 3.20634 1.391786
C  2.289527 -1.110748 -0.879871
C  2.463106 -2.721646 0.899441
C  -6.591612 -1.118613 -0.863329
C  2.597166 3.115189 -1.191383
C  2.018372 4.389602 0.808156
C  2.557567 4.341901 -0.497186
C  2.605424 -3.744842 -0.062122
C  2.563529 -3.376054 -1.423506
H  0.728495 1.068928 2.461482
H  -1.192015 -0.584173 2.527797
H  -0.018845 -1.734025 1.785404
H  -0.779657 1.901695 -0.227286
H  -1.654325 1.599064 1.314994
H  -1.483068 -2.132467 -0.134455
H  -2.376699 -2.437031 1.40111
H  -3.137259 1.195153 -0.601843
H  -1.957758 0.058271 -1.35036
H  2.013688 -0.850627 2.572995
H  3.103352 0.249264 1.723675
H  -3.852643 -1.677271 -1.275679
H  -4.399697 -2.191375 0.350368
H  -5.567269 0.054461 0.640654
H  -5.160561 0.470028 -1.043988
H  1.097552 3.235731 2.404253
H  2.478669 -2.969392 1.968093
H  -6.869048 -1.929231 -0.153491
H  -6.383656 -1.578546 -1.855068
H  3.035339 3.067728 -2.194528
H  1.989594 5.333204 1.363104
H  2.956805 5.246213 -0.969054
H  2.73807 -4.790424 0.230572
H  2.655279 -4.117849 -2.224476
H  -8.499785 -0.567604 -1.285627
