program: Gaussian 09
title: 000206161
version: EM64L-G09RevD.01
frameworkgroup: C1[X(C16H20FNO2)]
method: RPBEPBE
basis: SDD
operation: Freq
keyword: #p
keyword: freq=noraman
keyword: PBEPBE/SDD
title: #p freq=noraman PBEPBE/SDD
converged: NO YES NO NO
title: Mulliken charges:
elementType: F O O N C C C C C C C C C C C C C C C C H H H H H H H H H H H H H H H H H H H H
charge: -0.211793 -0.260924 -0.260748 -0.071060 -0.202753 -0.145997 -0.236364 -0.151757 -0.502488 -0.499735 -0.487389 0.483390 -0.648722 0.251420 -0.385294 -0.356635 -0.390401 -0.401819 0.317257 -0.505151 0.277729 0.230600 0.248740 0.219210 0.202114 0.234406 0.218384 0.238910 0.232919 0.217454 0.236604 0.227022 0.195425 0.228440 0.243629 0.251402 0.250124 0.227357 0.242724 0.243769
chargesum: 0.00000
title: Mulliken charges with hydrogens summed into heavy atoms:
elementType: F O O N C C C C C C C C C C C C C C C C
charge: -0.211793 -0.260924 -0.260748 -0.071060 0.074976 0.084603 0.012376 0.067452 -0.065968 -0.042441 -0.037016 0.483390 0.010329 0.251420 -0.156854 -0.113006 -0.138999 -0.151696 0.317257 0.208700
polarizability: 2.18360189e+02 -6.96502387e+00 1.43990577e+02 3.18937164e+00 -6.33124854e+00 1.61947652e+02
1716.lowfreq: -14.5567 0.0006 0.0006 0.0007 6.8146 10.0704 25.4470 44.6815 53.3570
frequency: 25.1633 44.6660 53.3323 72.1586 82.0930 104.5223 117.1703 149.0329 166.9579 184.1208 194.4789 208.7040 220.3295 265.2856 281.1352 297.7821 325.1642 344.6069 369.0807 382.2282 410.6384 432.6120 484.3695 493.2067 512.7660 569.7467 577.5915 622.5746 630.9087 674.2813 711.7881 730.6277 746.3151 756.7545 778.0960 789.4326 813.4837 815.0804 826.1600 829.1053 870.7959 895.0721 916.0396 941.8834 943.6986 956.8405 966.5745 977.0539 995.6166 1006.4316 1025.4110 1043.5530 1050.8247 1101.8348 1104.0228 1110.9304 1126.4484 1129.7017 1135.0576 1148.6533 1152.9765 1156.1100 1198.4830 1199.8640 1201.3235 1208.1409 1220.4851 1232.9174 1242.1509 1254.4853 1274.5385 1282.1873 1288.6738 1296.6531 1301.6761 1314.6862 1335.4861 1347.4321 1360.3454 1386.5566 1407.1121 1419.3778 1429.8254 1450.9777 1456.5568 1463.4353 1464.9963 1466.7652 1483.0041 1486.9124 1496.5576 1601.8775 1613.2803 1620.4024 2885.2552 2954.3631 2991.4777 2999.0478 3002.0768 3005.5681 3014.1842 3026.9283 3041.6545 3052.4117 3064.4470 3070.2993 3078.0473 3082.7651 3109.0746 3121.1600 3147.9834 3156.4267 3170.6591 3176.8248
redmass: 3.8579 7.0727 4.0430 3.7750 3.9048 1.1723 4.2946 4.4850 3.8810 2.4461 3.6933 1.2721 2.8983 4.4004 2.6389 4.5774 3.6087 5.2523 5.7235 2.2313 2.9467 3.9422 3.5885 5.5919 3.4369 3.7766 3.5030 4.1142 6.3454 5.2593 4.1042 3.9720 3.3731 4.2638 2.8922 2.6491 2.3376 1.5555 2.2651 2.0338 2.6209 2.7544 3.0898 1.4640 2.9688 1.3718 2.1269 3.1158 2.3436 2.8269 2.1224 2.1646 1.9244 1.4022 1.6351 1.2771 1.6474 1.5434 2.5948 1.4567 1.3909 1.5276 1.6019 1.9470 2.0681 1.8276 1.6293 1.7800 1.6759 1.4951 1.4101 1.4284 1.3097 1.3622 1.4448 1.4331 1.4325 1.6583 1.5612 3.9498 2.7710 1.2020 1.1667 1.0507 1.0899 1.0515 1.0685 1.0616 1.0576 1.0807 2.6023 7.4958 6.4167 9.7542 1.0534 1.0807 1.0634 1.0799 1.0610 1.0291 1.0631 1.0760 1.0881 1.1020 1.0912 1.0988 1.1031 1.1005 1.1046 1.0895 1.1050 1.0879 1.0951 1.0968
irintensity: 0.0250 0.3384 2.5557 0.0847 0.2995 0.2562 0.2031 1.0784 2.5181 0.6941 1.3808 1.0326 2.2837 5.2283 0.2430 5.2572 4.6187 1.0737 5.4559 1.9211 0.1486 5.5595 7.5775 11.2693 4.5412 16.5422 6.1588 5.5259 0.9463 14.9767 1.3101 5.0015 4.2801 2.0962 6.2523 32.3364 17.5593 5.4751 8.8544 41.0293 17.4185 3.4822 0.3831 0.9759 31.2966 0.3234 5.6815 23.5704 5.7031 13.9102 9.6030 1.4480 19.6819 14.7250 2.3581 0.1470 23.3627 20.4215 37.0424 18.7501 9.6852 51.9309 26.8567 7.0878 88.0850 8.2430 16.4294 17.0212 30.7680 9.1818 5.9906 7.8373 3.6702 1.7265 7.5582 0.5705 2.0651 15.4890 0.8322 0.7682 1.5672 20.1268 5.4373 11.5059 9.0328 10.2138 8.4863 12.3450 10.7362 25.5228 128.7484 6.2933 7.3588 179.2487 117.8408 19.4383 31.4472 7.1848 29.3019 32.8435 42.7371 42.3907 49.8222 2.5076 5.0321 19.9110 75.4087 28.3662 21.7394 13.7255 13.4155 7.1249 6.8048 3.6355
temp: 298.150 k
press: 1.00000 atm
elementType: 9 8 8 7 6 6 6 6 6 6 6 6 6 6 6 6 6 6 6 6 1 1 1 1 1 1 1 1 1 1 1 1 1 1 1 1 1 1 1 1
symmnumber: 1
zpe: 866137.6 jmol-1
zpe.correction: 0.329894 hartree
zpe.thermalcorrener: 0.348456 hartree
zpe.thermalcorrenthalpy: 0.349401 hartree
zpe.thermalcorrgfe: 0.282610 hartree
zpe.sumelectzpe: -925.225759 hartree
zpe.sumelectthermal: -925.207197 hartree
zpe.sumelectthermalent: -925.206252 hartree
zpe.sumelectthermalfe: -925.273043 hartree
dipole: 3.0058 -1.6281 -1.3680
dipole: 3.6820
quadrupole: -127.5331 -117.8049 -112.1268
quadrupole: -7.2770 -1.9333 -8.6203
quadrupole: -8.3782 1.3501 7.0281 -7.2770 -1.9333 -8.6203
hfenergy: -925.5556531 hartree
pointgroup: C01 [X(C16H20F1N1O2)]
dipole: -1.192063 0.623619 -0.537138 debye
polarizability: 217.6754746|-8.5636347|145.472795|-4.8530977|8.0914682|161.1501486 unknown
InChI: InChI=1S/C16H20FNO2/c1-18-12-7-8-14(18)15(16(19)20-2)13(9-12)10-3-5-11(17)6-4-10/h3-6,12-15H,7-9H2,1-2H3
charge 0 multiplicity 1
40 atoms
F  5.467615 0.143639 -0.29139
O  -0.13038 -1.96768 -0.355408
O  -1.186867 -2.42575 1.657997
N  -2.998472 -0.163046 -0.370807
C  -2.492732 0.193073 0.990953
C  -2.534855 1.014752 -1.175352
C  -0.951934 -0.081714 0.984688
C  -0.245917 0.853451 -0.051651
C  -1.009438 0.855314 -1.400804
C  -2.824558 1.718572 1.173366
C  -2.881724 2.268955 -0.291524
C  1.26818 0.635313 -0.148343
C  -4.457997 -0.406379 -0.425773
C  -0.777666 -1.591282 0.814811
C  2.070776 0.851126 1.003745
C  1.916454 0.261227 -1.351647
C  3.472226 0.687148 0.973487
C  3.318194 0.095296 -1.411527
C  4.065241 0.309199 -0.242606
C  0.022507 -3.429132 -0.556417
H  -2.961641 -0.447047 1.756276
H  -3.051993 1.028716 -2.150905
H  -0.567862 0.14286 2.000005
H  -0.366152 1.870948 0.378336
H  -0.633737 1.677741 -2.040823
H  -0.850372 -0.100492 -1.929409
H  -2.072141 2.238267 1.793674
H  -3.79824 1.833671 1.681507
H  -3.891656 2.645186 -0.532912
H  -2.173332 3.099384 -0.461645
H  -4.700665 -1.277786 0.207402
H  -4.743607 -0.652077 -1.464068
H  -5.088634 0.451677 -0.089859
H  1.598005 1.157569 1.945261
H  1.326908 0.083025 -2.254916
H  4.09186 0.851186 1.859931
H  3.823276 -0.193713 -2.338023
H  0.590543 -3.524927 -1.492424
H  -0.969786 -3.903246 -0.639637
H  0.569669 -3.87652 0.289932
