program: Gaussian 09
title: 000206159
version: EM64L-G09RevD.01
frameworkgroup: C1[X(C22H25N3O3)]
method: RPBEPBE
basis: SDD
operation: Freq
keyword: #p
keyword: freq=noraman
keyword: PBEPBE/SDD
title: #p freq=noraman PBEPBE/SDD
converged: YES YES NO NO
title: Mulliken charges:
elementType: O O O N N N C C C C C C C C C C C C C C C C C C C C C C H H H H H H H H H H H H H H H H H H H H H H H H H
charge: -0.249700 -0.214176 -0.232845 -0.187941 -0.105758 -0.451155 -0.028617 -0.353680 -0.401860 0.098897 -0.344519 0.397544 0.438599 0.165143 -0.355846 -0.337783 -0.321072 -0.315618 -0.336004 -0.383784 -0.415169 -0.382075 -0.239319 -0.237966 -0.226334 -0.236472 -0.243357 -0.242117 0.256466 0.235219 0.207479 0.234148 0.197370 0.221918 0.334265 0.187576 0.251981 0.201535 0.191130 0.210449 0.197009 0.187820 0.210911 0.265222 0.257177 0.259444 0.250281 0.229846 0.230509 0.229037 0.230896 0.231668 0.233626
chargesum: 0.00000
title: Mulliken charges with hydrogens summed into heavy atoms:
elementType: O O O N N N C C C C C C C C C C C C C C C C C C C C C C
charge: -0.249700 -0.214176 -0.232845 -0.187941 -0.105758 -0.116890 -0.028617 0.138005 0.039767 0.098897 0.074769 0.397544 0.438599 0.165143 0.083711 0.054882 0.086387 0.083114 -0.070782 -0.126606 -0.155725 -0.131794 -0.009473 -0.007457 0.002704 -0.005576 -0.011689 -0.008490
polarizability: 2.64654354e+02 -5.93858487e+00 2.58375021e+02 2.08910314e+01 4.98925180e+00 2.42920693e+02
1716.lowfreq: -9.4866 -6.1536 -0.0008 0.0002 0.0008 2.4688 6.6097 19.3118 21.6878
frequency: 5.5923 19.2152 21.3214 24.1289 43.1773 50.5383 57.6385 65.1287 79.2258 93.4630 103.0300 141.7615 152.0125 214.0173 216.0835 236.5862 242.2558 252.6136 262.5510 298.9523 303.5666 313.1126 340.6810 346.5398 354.8927 380.3727 398.8831 399.3908 403.6604 445.6581 467.8166 487.8465 490.4300 500.9342 517.0417 579.0494 586.9417 595.5699 615.3887 616.6500 663.5451 672.8298 680.7408 693.0363 701.2573 707.2348 717.4523 734.2204 767.4005 777.4572 795.0047 806.5709 839.5805 851.1776 858.2617 861.7397 875.3762 897.4983 906.8336 927.1680 930.0733 947.9270 978.2460 982.8697 987.8657 990.5318 993.6537 998.5821 1000.7597 1005.1941 1027.0525 1027.9686 1030.2933 1050.2684 1055.0033 1066.9987 1080.0124 1084.1785 1091.0734 1095.3754 1106.6990 1109.6133 1142.3281 1143.4998 1173.0169 1175.3432 1181.6675 1190.7241 1192.2937 1197.1196 1206.1632 1216.4988 1222.7159 1254.7753 1267.6608 1284.0311 1295.4502 1316.8524 1317.4086 1325.1301 1330.5688 1334.9971 1340.6569 1348.2466 1352.9451 1359.6012 1368.3030 1369.9085 1378.1611 1382.6066 1387.9745 1434.3084 1437.9745 1441.8588 1446.7928 1449.6938 1449.8792 1455.4549 1461.1441 1479.0276 1480.1172 1482.8617 1590.1472 1593.5471 1609.0192 1611.1170 1641.9373 1709.4868 2854.5909 2866.5726 2886.5048 2949.3016 2959.7312 2996.2261 3020.0243 3022.8653 3027.3899 3049.4224 3057.1971 3076.4978 3083.7994 3088.8411 3124.6218 3126.9165 3132.0349 3135.7068 3142.9107 3147.9660 3152.6911 3156.6964 3167.4500 3168.1136 3599.0858
redmass: 5.2738 3.7090 4.2175 4.7710 4.1479 3.7334 5.1969 5.5426 5.5969 5.2080 5.2356 5.4801 5.8738 3.6249 4.6790 2.2424 2.9236 3.2356 5.8404 3.5106 3.2952 5.3571 3.5431 5.4428 2.9939 2.4113 2.7888 2.6530 2.8392 2.6894 2.7373 2.3336 1.8656 2.9700 2.4778 2.4406 4.5760 6.0119 6.3883 6.3903 6.1333 4.6403 5.2812 5.2751 1.7129 1.8094 4.0580 3.7135 2.1195 2.0662 2.6868 3.3860 1.6049 1.2534 1.2551 2.8388 2.7455 2.3871 3.9957 1.5689 1.6775 2.0823 1.3982 1.4497 3.2615 5.9082 3.8221 1.3413 1.3873 2.2957 2.3284 2.1751 2.1641 2.4977 2.0486 2.4442 2.7837 2.1354 1.7243 3.1555 2.3931 2.3103 2.4985 2.2700 1.0970 1.0527 2.1793 1.0762 1.3358 1.1368 3.8589 1.3525 3.0765 1.4659 1.3102 1.5100 1.2536 1.3498 1.5494 1.3415 1.3365 1.4893 1.4585 1.4264 1.5498 1.4618 1.4923 1.8276 6.7471 8.8973 1.4239 2.2210 2.2326 1.0833 1.0832 1.0968 1.1084 1.0992 1.0920 1.1172 2.0985 2.1841 6.0601 6.2772 6.0010 6.0160 11.2334 9.7095 1.0705 1.0697 1.0705 1.0665 1.0664 1.0609 1.0619 1.0873 1.0881 1.0903 1.0996 1.0962 1.0977 1.1058 1.0858 1.0848 1.0872 1.0880 1.0920 1.0923 1.0961 1.0959 1.1015 1.1012 1.0800
irintensity: 0.0811 0.0402 0.3106 0.0892 0.0121 0.4285 1.1594 0.0693 0.7570 0.3746 0.1043 4.6948 4.4244 0.8180 0.2195 2.6999 3.7267 5.5311 1.8888 4.8275 6.0566 0.5295 23.5046 0.7897 8.9943 2.7845 0.1206 2.0470 0.6660 3.5186 0.9089 36.7228 70.0411 19.5619 41.0381 7.1999 21.0514 14.7376 1.3925 1.1649 13.7487 1.0264 15.5720 14.1450 43.3463 60.0826 23.3102 13.1026 51.9215 29.8361 22.1357 9.4350 0.0916 0.1038 1.9328 5.3795 5.2741 5.9520 9.4959 1.2499 4.8458 47.8188 0.3314 0.8242 5.0526 1.0231 1.4414 0.2553 1.3432 23.2341 7.6575 12.7792 10.4665 17.1622 5.3666 7.4408 32.3363 8.1005 10.3739 27.2695 28.4180 4.9923 60.5857 0.9051 0.4819 0.0610 5.8564 1.1700 3.4165 1.4490 8.7178 1.2200 47.6539 18.0796 7.5549 75.0625 2.2526 8.8174 69.4784 2.5018 3.2629 55.7833 83.2910 10.8183 20.2449 11.4591 33.3904 83.8427 10.1907 1.2013 5.9425 20.0764 7.1066 2.4108 0.7485 6.2936 35.6099 5.7983 19.2864 7.7555 20.5797 19.9428 0.7318 0.3986 5.3677 5.9958 458.1918 297.0779 64.6159 63.2971 136.0151 54.5814 75.7807 23.5722 9.7172 47.9958 21.2970 10.7179 57.0282 46.8707 36.1739 2.2866 2.9223 0.2845 0.1357 4.8184 14.7787 17.6472 28.3636 23.4068 23.0511 15.0873 47.6555
temp: 298.150 k
press: 1.00000 atm
elementType: 8 8 8 7 7 7 6 6 6 6 6 6 6 6 6 6 6 6 6 6 6 6 6 6 6 6 6 6 1 1 1 1 1 1 1 1 1 1 1 1 1 1 1 1 1 1 1 1 1 1 1 1 1
symmnumber: 1
zpe: 1135988.9 jmol-1
zpe.correction: 0.432675 hartree
zpe.thermalcorrener: 0.457734 hartree
zpe.thermalcorrenthalpy: 0.458678 hartree
zpe.thermalcorrgfe: 0.373127 hartree
zpe.sumelectzpe: -1241.232908 hartree
zpe.sumelectthermal: -1241.207849 hartree
zpe.sumelectthermalent: -1241.206905 hartree
zpe.sumelectthermalfe: -1241.292457 hartree
dipole: -3.4024 1.2158 0.3818
dipole: 3.6332
quadrupole: -159.8414 -154.5910 -174.7308
quadrupole: -4.9518 16.1680 10.2458
quadrupole: 3.2130 8.4634 -11.6764 -4.9518 16.1680 10.2458
hfenergy: -1241.6655834 hartree
pointgroup: C01 [X(C22H25N3O3)]
dipole: -1.3337345 -0.4680316 -0.2129119 debye
polarizability: 264.1571934|9.2001113|256.7625237|-19.959229|6.7570664|245.0303516 unknown
InChI: InChI=1S/C22H25N3O3/c26-20-22(18-8-3-1-4-9-18,19-10-5-2-6-11-19)23-21(27)25(20)13-7-12-24-14-16-28-17-15-24/h1-6,8-11,23H,7,12-17H2
charge 0 multiplicity 1
53 atoms
O  5.828483 -0.322849 2.008665
O  0.364222 0.291418 1.132737
O  -0.561676 2.358294 -2.992882
N  0.257858 1.405559 -0.956626
N  3.817245 0.113892 -0.038116
N  -1.830672 0.878507 -1.625743
C  -1.687299 0.170473 -0.33285
C  1.602712 2.011781 -1.013247
C  2.574037 1.21672 -1.913828
C  -0.236858 0.612215 0.077911
C  3.013335 -0.114436 -1.263668
C  -1.672798 -1.36596 -0.49284
C  -2.758397 0.662497 0.663619
C  -0.720069 1.624758 -1.98768
C  3.633777 -0.928902 1.00517
C  5.25811 0.330575 -0.318138
C  4.391677 -0.524221 2.278445
C  5.995201 0.712146 0.976858
C  -1.631941 -2.179245 0.668745
C  -4.051134 0.079601 0.630775
C  -1.636182 -1.976287 -1.768682
C  -2.514383 1.745732 1.542977
C  -1.56817 -3.58332 0.551279
C  -5.083771 0.57759 1.454213
C  -1.57879 -3.384631 -1.884531
C  -3.5460 2.239766 2.371645
C  -1.54589 -4.192557 -0.72615
C  -4.834811 1.661326 2.327696
H  2.001397 2.030385 0.016633
H  1.481854 3.042203 -1.390207
H  3.461582 1.851797 -2.099594
H  2.104395 1.030097 -2.898375
H  3.568993 -0.730399 -2.012117
H  2.114771 -0.695998 -0.98469
H  -2.720508 0.977805 -2.11152
H  4.004602 -1.927596 0.662502
H  2.556138 -1.008701 1.235447
H  5.373561 1.147198 -1.056266
H  5.730476 -0.588647 -0.750481
H  4.345294 -1.319512 3.04056
H  3.953864 0.412014 2.686579
H  5.60438 1.682981 1.35274
H  7.082465 0.789638 0.80853
H  -1.638927 -1.708728 1.657405
H  -4.244537 -0.774631 -0.028599
H  -1.64783 -1.351924 -2.66836
H  -1.517792 2.196132 1.599218
H  -1.534275 -4.20236 1.454608
H  -6.077799 0.118311 1.418386
H  -1.556824 -3.847084 -2.877652
H  -3.342735 3.073184 3.053012
H  -1.499764 -5.2836 -0.815853
H  -5.633897 2.045991 2.970942
