program: Gaussian 09
title: 000206148
version: EM64L-G09RevD.01
frameworkgroup: C1[X(C21H23NO2)]
method: RPBEPBE
basis: SDD
operation: Freq
keyword: #p
keyword: freq=noraman
keyword: PBEPBE/SDD
title: #p freq=noraman PBEPBE/SDD
converged: YES YES NO NO
title: Mulliken charges:
elementType: O O N C C C C C C C C C C C C C C C C C C C C C H H H H H H H H H H H H H H H H H H H H H H H
charge: -0.273930 -0.241034 -0.123209 -0.557744 0.166342 0.272105 0.206154 -0.298287 -0.299417 0.157940 -0.364841 -0.405440 -0.142092 -0.387176 0.143798 0.475015 -0.429959 -0.688237 -0.695436 -0.355332 -0.425671 -0.247319 -0.249317 -0.535998 0.228686 0.260770 0.182540 0.229708 0.179221 0.208882 0.285238 0.284142 0.245042 0.206967 0.231439 0.204762 0.209385 0.221455 0.218753 0.214825 0.282847 0.239927 0.234452 0.232065 0.225931 0.225906 0.246139
chargesum: 0.00000
title: Mulliken charges with hydrogens summed into heavy atoms:
elementType: O O N C C C C C C C C C C C C C C C C C C C C C
charge: -0.273930 -0.241034 -0.123209 -0.068288 0.166342 0.272105 0.206154 0.113962 0.088687 0.157940 -0.079603 -0.121298 -0.142092 -0.142134 0.143798 0.475015 -0.222992 -0.042651 -0.040403 -0.072484 -0.185744 -0.012867 -0.017252 0.161979
polarizability: 3.94548146e+02 3.55524096e+01 2.73778872e+02 -7.62442007e+00 1.49851018e+01 1.45183654e+02
1716.lowfreq: -9.6967 -7.4333 -0.0003 0.0007 0.0009 2.1664 19.9567 29.5337 35.7220
frequency: 19.8418 29.5279 35.6082 43.8146 62.4732 72.4529 80.0098 99.4587 111.1432 133.5152 165.1936 189.8766 200.4701 209.5957 223.5787 228.6001 249.3590 270.8797 282.2809 291.6439 308.5569 329.6327 347.9326 367.9987 397.4434 407.0552 421.0343 435.2441 459.5848 472.6919 508.8745 519.4626 536.5690 561.4473 588.5894 612.6263 631.6174 650.8175 669.3913 696.0402 735.6560 749.4301 759.1750 775.2460 793.4739 796.6683 800.0893 829.5409 838.9873 847.7818 861.1550 880.4780 900.7719 917.5581 972.0606 972.4610 975.1713 979.5109 996.0917 998.4583 1021.2069 1048.4481 1053.0190 1062.1145 1073.2763 1085.7874 1107.1160 1111.8468 1115.9661 1146.1837 1160.6175 1169.4167 1175.5103 1186.3958 1191.0359 1197.6433 1231.5947 1242.1331 1252.0745 1261.2969 1281.7151 1285.4001 1298.0343 1312.4695 1359.7522 1365.3478 1369.1998 1384.0919 1386.1280 1388.8671 1395.1579 1398.3162 1413.8012 1437.2554 1460.2066 1464.4655 1467.3604 1469.0935 1470.0667 1471.8775 1474.6170 1475.9986 1479.0893 1486.0813 1487.7178 1492.3524 1497.9404 1561.8069 1566.4653 1595.2813 1605.9010 1642.0413 2845.5146 2866.8448 2938.6349 2966.2201 2982.3503 2984.1145 3026.2462 3037.8428 3039.8801 3057.5838 3074.0397 3078.5264 3084.9331 3086.6715 3091.2121 3112.5927 3121.3789 3126.4800 3138.0281 3154.4352 3155.5972 3170.6946 3173.7125
redmass: 3.1989 5.5453 3.2390 4.0753 2.9572 1.9822 3.6778 2.7492 4.3961 3.5721 3.3633 3.0276 1.9487 1.9697 1.8849 1.6287 1.7686 3.9163 3.1881 2.3679 3.1515 4.6129 3.0362 2.9179 7.2069 3.6916 4.2788 3.0401 3.9573 3.5762 4.1793 3.9235 4.4458 5.7595 4.4644 4.6468 4.2626 6.0968 4.8341 3.8651 2.6754 2.4811 2.5062 3.1933 1.5219 1.2066 1.5889 1.7303 2.2438 2.8179 4.1835 4.0411 1.7088 2.1790 1.5891 2.2475 1.4641 2.9780 2.0903 1.4993 1.3108 2.7737 2.8943 2.7741 1.9198 2.0974 2.2666 1.2594 1.9817 1.4740 2.1358 2.2001 1.1293 2.2524 1.9830 1.7731 1.8718 2.8154 1.7029 1.3555 1.1682 1.1749 3.3346 1.5088 1.3095 1.3674 1.9206 2.1876 1.2826 1.2632 4.3776 3.3406 1.9416 1.2566 2.1456 1.0666 1.0638 1.1513 1.2837 1.0609 1.1446 1.2461 1.1052 1.2225 1.8093 1.0828 8.5698 7.5032 7.2246 6.6724 5.9567 6.7986 1.0721 1.0714 1.0668 1.0325 1.0359 1.0357 1.0912 1.0878 1.0873 1.1043 1.0980 1.0978 1.0858 1.1001 1.1003 1.0931 1.0868 1.1001 1.0898 1.0871 1.0948 1.0982 1.0961
irintensity: 0.5013 2.3756 0.1767 0.5242 0.2284 0.2665 0.2863 4.0796 4.6427 3.4488 1.6958 0.8446 2.0099 0.7805 1.9092 0.6849 1.4146 4.7838 3.8428 3.4924 3.2132 2.9254 0.7241 0.1028 2.8362 3.4394 0.8915 3.9487 1.1064 1.3336 4.7702 4.8593 6.7812 0.8376 27.4258 3.2536 1.0730 3.3585 4.9164 29.7069 15.5135 8.5569 20.2499 8.1107 6.4917 0.9863 7.5958 51.8647 26.6333 12.1118 0.1067 14.1499 7.2285 0.9711 4.2918 18.5164 2.6512 7.5107 2.8290 2.8551 0.4571 22.4223 70.4496 100.0921 21.3579 5.8150 11.8061 0.0518 6.8464 8.6534 32.7813 6.7237 3.1944 9.8013 18.1137 16.4168 16.7203 224.4220 23.9530 11.0788 8.7264 14.4978 156.5926 3.4136 6.1755 20.6629 33.4337 4.5952 22.4463 17.5949 36.0485 9.7369 5.7613 2.0410 40.5935 5.2448 6.3889 11.4878 16.2633 12.9630 13.8819 10.0462 7.9361 18.9956 14.8197 32.7402 123.7316 54.9706 10.1699 132.9089 7.2190 4.4278 93.7215 145.4763 50.1664 80.1695 34.4073 22.6861 13.1503 5.2251 14.1608 38.8312 37.9199 81.2549 22.3552 41.1561 47.3209 34.4585 4.2778 23.5934 14.9703 3.0063 21.2043 30.3326 9.8393
temp: 298.150 k
press: 1.00000 atm
elementType: 8 8 7 6 6 6 6 6 6 6 6 6 6 6 6 6 6 6 6 6 6 6 6 6 1 1 1 1 1 1 1 1 1 1 1 1 1 1 1 1 1 1 1 1 1 1 1
symmnumber: 1
zpe: 1015341.3 jmol-1
zpe.correction: 0.386723 hartree
zpe.thermalcorrener: 0.409446 hartree
zpe.thermalcorrenthalpy: 0.410390 hartree
zpe.thermalcorrgfe: 0.333377 hartree
zpe.sumelectzpe: -1017.463261 hartree
zpe.sumelectthermal: -1017.440538 hartree
zpe.sumelectthermalent: -1017.439594 hartree
zpe.sumelectthermalfe: -1017.516607 hartree
dipole: 3.5287 -0.6952 -2.1626
dipole: 4.1967
quadrupole: -123.7932 -125.7369 -148.9327
quadrupole: 16.8894 4.8612 -3.6283
quadrupole: 9.0277 7.0840 -16.1118 16.8894 4.8612 -3.6283
hfenergy: -1017.8499846 hartree
pointgroup: C01 [X(C21H23N1O2)]
dipole: -1.3484324 0.3293058 -0.8940904 debye
polarizability: 390.3997417|37.612471|277.481378|25.8764166|2.2702064|145.6295529 unknown
InChI: InChI=1S/C21H23NO2/c1-4-22(5-2)14-19-17-11-10-15-8-6-7-9-16(15)21(23)18(17)12-13-20(19)24-3/h6-13H,4-5,14H2,1-3H3
charge 0 multiplicity 1
47 atoms
O  -3.342186 -2.061908 -1.299502
O  2.542306 -2.39227 1.058693
N  -3.020812 1.400708 0.143107
C  -2.560032 0.584431 -1.027263
C  -1.593997 -0.543713 -0.670129
C  -0.247654 -0.284356 -0.226252
C  0.645206 -1.389047 0.015741
C  -3.729134 0.575875 1.164629
C  -3.840064 2.559986 -0.310301
C  -2.019686 -1.885059 -0.861189
C  0.092466 1.121475 -0.003438
C  0.158163 -2.711788 -0.176694
C  2.066671 -1.343559 0.498603
C  -1.143882 -2.973477 -0.612901
C  3.014438 -0.201375 0.257011
C  2.666948 1.183409 0.119158
C  1.31532 1.730496 0.137911
C  -3.766808 1.242988 2.552167
C  -3.020108 3.666376 -1.002408
C  4.39206 -0.568503 0.2373
C  3.726868 2.138438 -0.004501
C  5.412597 0.382332 0.074958
C  5.075226 1.75548 -0.040027
C  -3.827064 -3.431061 -1.500747
H  -2.049505 1.272475 -1.726032
H  -3.427001 0.148965 -1.570527
H  -4.766999 0.322587 0.830324
H  -3.184303 -0.380976 1.249807
H  -4.665946 2.22377 -0.990048
H  -4.322981 2.994468 0.582867
H  -0.784062 1.777282 0.059221
H  0.845122 -3.534522 0.041134
H  -1.467838 -4.007284 -0.759341
H  1.283353 2.824486 0.246029
H  -2.740743 1.466496 2.892669
H  -4.34182 2.186779 2.552868
H  -4.241791 0.565947 3.286513
H  -2.206342 4.011386 -0.339788
H  -2.571932 3.328644 -1.953951
H  -3.669812 4.530774 -1.233333
H  4.628621 -1.628032 0.37186
H  3.461873 3.199607 -0.083059
H  6.46069 0.065493 0.049549
H  5.860108 2.5117 -0.150699
H  -3.802221 -4.00993 -0.557824
H  -3.2383 -3.956242 -2.276957
H  -4.867416 -3.315855 -1.838311
