program: Gaussian 09
title: 000206131
version: EM64L-G09RevD.01
frameworkgroup: C1[X(C15H26N2O2)]
method: RPBEPBE
basis: SDD
operation: Freq
keyword: #p
keyword: freq=noraman
keyword: PBEPBE/SDD
title: #p freq=noraman PBEPBE/SDD
converged: YES YES NO NO
title: Mulliken charges:
elementType: O O N N C C C C C C C C C C C C C C C H H H H H H H H H H H H H H H H H H H H H H H H H H
charge: -0.238302 -0.265778 -0.264881 -0.378277 -0.004176 -0.021917 -0.429063 -0.419467 -0.399198 -0.394612 -0.424611 -0.457318 -0.390370 -0.397179 -0.410994 -0.378273 0.179932 0.195345 -0.775283 0.249964 0.250689 0.214149 0.194220 0.211517 0.243543 0.197527 0.196011 0.195359 0.199693 0.248391 0.196205 0.207800 0.214042 0.197881 0.194558 0.199810 0.207180 0.213082 0.182862 0.195288 0.205548 0.313747 0.230137 0.253504 0.261713
chargesum: 0.00000
title: Mulliken charges with hydrogens summed into heavy atoms:
elementType: O O N N C C C C C C C C C C C C C C C
charge: -0.238302 -0.265778 -0.264881 -0.064530 0.245788 0.228772 -0.020694 0.035594 -0.005661 0.000440 0.019985 -0.035475 0.002070 0.009811 -0.015050 0.022563 0.179932 0.195345 -0.029929
polarizability: 2.03740319e+02 8.01835114e-01 1.77309802e+02 1.41664432e-02 -5.71797239e+00 1.48577814e+02
1716.lowfreq: -26.9911 -9.5368 -5.9371 -0.0004 0.0002 0.0005 8.8064 35.7244 39.3821
frequency: -16.6382 35.4871 39.2251 52.6334 63.2403 79.5573 92.0439 110.2402 124.6988 162.4485 187.3134 207.6377 220.8484 230.9901 236.5821 302.9912 317.1157 330.7537 374.5390 376.2961 418.2011 426.8882 440.7046 460.5710 465.7927 484.1349 501.8496 541.7714 548.3668 603.1731 635.7106 646.6785 735.2761 774.0287 778.5823 788.3173 799.8243 826.7564 829.5159 847.7611 861.0006 874.2900 885.6963 898.0373 920.3629 925.1909 957.6764 968.5275 1003.1930 1009.4403 1026.3464 1035.0502 1044.0106 1046.3368 1051.1610 1060.6820 1078.9231 1087.3487 1108.3986 1114.4521 1116.1894 1150.5593 1155.0961 1161.8514 1199.0526 1205.7974 1243.3335 1247.2188 1257.1051 1258.4509 1264.2771 1272.1006 1286.6438 1302.6677 1309.1501 1325.5597 1330.7203 1332.1262 1335.2101 1335.9682 1341.1443 1341.4533 1348.9802 1349.8619 1355.3422 1364.4705 1372.2641 1385.8108 1444.7075 1451.6673 1459.2115 1460.3716 1460.9813 1463.6726 1465.2888 1468.3377 1470.2074 1472.0155 1474.0074 1480.2851 1484.3827 1586.0959 1622.6794 2954.2905 2967.5927 2968.0768 2968.6157 2970.1787 2970.5965 2972.1766 2981.2281 2982.0653 2997.0946 2997.4341 3009.2877 3017.3501 3027.6342 3029.2161 3031.0271 3033.8286 3035.9483 3039.0327 3043.4447 3044.9952 3059.1825 3065.8766 3089.9883 3124.2314 3551.0555
redmass: 4.1286 3.7130 3.0810 5.2007 4.4273 3.3921 3.0614 2.7344 1.3631 2.9001 3.1674 2.7994 1.8374 2.8698 4.6048 2.8876 2.4923 1.9050 2.9707 2.2650 2.9609 3.7178 2.8042 2.5956 2.2562 2.3120 2.5163 1.2493 2.9337 3.6174 3.7341 2.6654 7.3882 1.8526 2.1323 1.4757 3.0564 3.0838 1.7000 2.2862 2.3581 2.1080 2.0605 1.6570 1.6796 1.4329 2.4433 2.4067 2.4652 2.5904 2.0696 1.6353 1.7992 1.5258 1.6767 1.1247 1.3363 1.7249 2.7867 1.0978 2.9701 2.1657 2.1324 2.3174 1.6065 2.0523 1.3362 1.4124 1.2842 1.2864 1.3233 1.2963 2.1748 1.9226 1.3376 1.5119 1.3358 1.4377 1.4592 1.4467 1.4586 1.4710 1.3959 1.4365 1.4584 1.3602 1.4011 1.2083 1.2172 1.3151 1.1134 1.1876 1.0881 1.0895 1.0918 1.0905 1.0648 1.0838 1.0843 1.0941 1.1423 8.0609 8.7072 1.0672 1.0602 1.0659 1.0630 1.0605 1.0623 1.0634 1.0621 1.0642 1.0617 1.0391 1.0847 1.0851 1.0977 1.0942 1.0952 1.0957 1.1016 1.1012 1.1035 1.1015 1.0992 1.1028 1.0950 1.1013 1.0776
irintensity: 0.6829 0.8590 0.4241 4.9133 4.2275 2.8747 1.9111 2.4329 1.0792 5.1275 1.4534 0.7773 0.0180 2.8796 6.3777 1.6370 2.4865 0.0664 1.7070 0.0123 3.9043 0.8205 3.4379 4.3595 6.3366 0.5372 5.9168 48.3196 18.6302 17.9423 4.4393 7.9689 14.2305 5.0347 3.0713 0.4623 0.8953 1.5524 3.9690 6.7777 6.4768 2.0749 23.8517 14.2388 0.1240 7.3704 25.1109 0.3216 11.3991 10.7545 20.8769 4.2461 0.6406 0.8760 1.7107 1.0633 2.8003 1.0259 3.4338 5.1175 21.9022 2.1125 6.9699 10.3309 1.9480 187.3614 14.9563 29.0280 5.3157 7.7244 2.7566 10.5938 176.0150 49.2931 1.1536 19.5116 2.3635 25.0390 17.2579 13.3145 0.3549 1.7033 1.0570 4.5104 5.1131 3.4455 18.2428 28.9331 63.0914 202.1890 29.4883 94.2519 9.7965 5.8759 25.4450 11.0680 28.9474 17.7090 30.7207 2.5869 43.3857 258.0463 184.4480 29.4103 44.5061 22.8245 47.4676 54.2185 19.8256 23.3572 18.7435 27.8383 11.5833 10.6667 21.6064 36.8258 70.0230 72.4974 60.3313 54.8543 3.5728 11.0514 57.2362 105.4716 42.5321 30.9631 12.2886 13.0807 24.8497
temp: 298.150 k
press: 1.00000 atm
elementType: 8 8 7 7 6 6 6 6 6 6 6 6 6 6 6 6 6 6 6 1 1 1 1 1 1 1 1 1 1 1 1 1 1 1 1 1 1 1 1 1 1 1 1 1 1
symmnumber: 1
zpe: 1035956.7 jmol-1
zpe.correction: 0.394575 hartree
zpe.thermalcorrener: 0.413341 hartree
zpe.thermalcorrenthalpy: 0.414285 hartree
zpe.thermalcorrgfe: 0.347157 hartree
zpe.sumelectzpe: -845.681786 hartree
zpe.sumelectthermal: -845.663020 hartree
zpe.sumelectthermalent: -845.662076 hartree
zpe.sumelectthermalfe: -845.729204 hartree
dipole: 4.4242 -1.5124 -0.8617
dipole: 4.7543
quadrupole: -108.6791 -119.2958 -123.7250
quadrupole: 9.3203 -2.5710 6.0077
quadrupole: 8.5542 -2.0625 -6.4917 9.3203 -2.5710 6.0077
hfenergy: -846.076361 hartree
pointgroup: C01 [X(C15H26N2O2)]
dipole: -1.7167768 -0.559094 0.4886755 debye
polarizability: 203.7603749|0.3310674|178.1985505|0.1858631|-2.3967148|147.6690091 unknown
InChI: InChI=1S/C15H26N2O2/c1-12(18)17(14-10-6-3-7-11-14)15(19)16-13-8-4-2-5-9-13/h13-14,16H,2-11H2,1H3
charge 0 multiplicity 1
45 atoms
O  0.182021 -0.467127 -1.931457
O  1.781669 3.153573 0.383133
N  0.901538 1.095384 -0.269246
N  -1.361024 0.420102 -0.431642
C  2.12783 0.388893 0.237718
C  -2.542762 -0.246139 -1.032152
C  1.76303 -0.905102 1.000435
C  3.1496 0.121558 -0.896009
C  3.042402 -1.578402 1.557461
C  4.420342 -0.558931 -0.331799
C  -2.593756 -1.755515 -0.666412
C  -3.833384 0.477451 -0.575375
C  4.068967 -1.856879 0.433847
C  -2.896464 -1.983714 0.832402
C  -4.150798 0.241005 0.92392
C  -4.202549 -1.269766 1.258298
C  -0.096461 0.296005 -0.961076
C  0.878868 2.505196 -0.22621
C  -0.247331 3.235151 -0.957503
H  2.578928 1.108732 0.947904
H  -2.426659 -0.158781 -2.129143
H  1.251142 -1.612545 0.317455
H  1.063148 -0.670024 1.826545
H  3.409702 1.080567 -1.382216
H  2.676949 -0.521831 -1.660769
H  2.772469 -2.519359 2.074715
H  3.504917 -0.915348 2.317736
H  4.941817 0.140299 0.354531
H  5.122895 -0.778186 -1.15862
H  -1.638239 -2.226232 -0.958985
H  -3.388811 -2.225754 -1.280365
H  -4.67164 0.081664 -1.181326
H  -3.759378 1.560175 -0.797154
H  4.984441 -2.310993 0.860205
H  3.64177 -2.594826 -0.276023
H  -2.050805 -1.602374 1.441617
H  -2.968637 -3.068374 1.039104
H  -5.113038 0.725427 1.176946
H  -3.386854 0.72975 1.566541
H  -5.059069 -1.728878 0.72229
H  -4.386744 -1.414151 2.340137
H  -1.477287 0.955002 0.430316
H  -1.086563 3.44796 -0.2697
H  -0.640114 2.679988 -1.823933
H  0.157421 4.203542 -1.291144
