program: Gaussian 09
title: 000211979
version: EM64L-G09RevD.01
frameworkgroup: C1[X(C19H31NO2)]
method: RPBEPBE
basis: SDD
operation: Freq
keyword: #p
keyword: freq=noraman
keyword: PBEPBE/SDD
title: #p freq=noraman PBEPBE/SDD
converged: NO YES NO NO
title: Mulliken charges:
elementType: O O N C C C C C C C C C C C C C C C C C C C H H H H H H H H H H H H H H H H H H H H H H H H H H H H H H H
charge: -0.452296 -0.308749 -0.206887 0.338489 0.331442 -0.449274 -0.457836 -0.438555 -0.408918 -0.722653 -0.764186 -0.732952 -0.731643 -0.121512 -0.293805 0.243905 0.298648 -0.342643 -0.386480 -0.789357 -0.244813 -0.246791 0.198272 0.202924 0.196865 0.207010 0.209540 0.211922 0.237920 0.217116 0.196240 0.213465 0.225940 0.230372 0.219134 0.219599 0.220907 0.229267 0.204973 0.212147 0.216493 0.208541 0.198075 0.227578 0.214293 0.355679 0.247251 0.231013 0.217042 0.239127 0.228794 0.223946 0.225418
chargesum: 0.00000
title: Mulliken charges with hydrogens summed into heavy atoms:
elementType: O O N C C C C C C C C C C C C C C C C C C C
charge: -0.096618 -0.308749 -0.206887 0.338489 0.331442 -0.048077 -0.053962 -0.017093 0.046118 -0.087008 -0.095081 -0.077805 -0.094462 0.076563 0.148066 0.243905 0.298648 -0.095392 -0.155466 -0.104393 -0.020867 -0.021372
polarizability: 2.61813744e+02 -2.46912993e+00 2.21306004e+02 1.00368706e+01 1.78883142e+00 1.67561960e+02
1716.lowfreq: -7.1574 -4.3020 -0.0007 0.0001 0.0003 9.7443 21.7830 23.5462 36.8536
frequency: 21.2851 22.3922 36.7557 53.7323 68.9442 92.0778 105.0055 120.9643 141.5857 148.7982 154.0795 170.0423 177.2750 189.6378 224.9606 227.0415 239.6660 257.7514 269.1236 288.6434 292.6610 303.6054 312.2336 324.0230 355.8951 377.7102 389.7546 398.1020 426.0717 434.3089 441.7615 453.7534 455.1451 469.8817 496.5804 501.1321 511.6911 541.4652 546.1957 591.3739 601.0710 699.2299 715.6365 719.9629 753.7876 755.2459 791.7403 797.5057 815.3021 842.6363 849.2710 865.9385 888.5790 896.3871 907.8302 910.6953 927.9909 962.4509 965.0875 972.3658 973.4102 975.2163 983.0715 987.3972 992.9840 1024.6006 1035.4576 1045.1521 1048.8397 1078.6393 1093.7169 1108.4635 1114.4296 1116.7287 1137.3224 1152.4641 1171.9701 1173.4203 1180.9337 1190.2439 1195.7517 1217.4913 1227.5284 1233.8457 1239.1839 1250.3518 1266.6235 1276.5755 1286.6362 1291.5127 1317.5478 1324.8996 1332.9933 1340.6247 1350.2585 1368.6422 1371.3641 1373.8040 1381.4250 1388.0621 1391.6405 1398.1248 1399.2352 1429.5905 1447.8384 1454.1718 1458.4884 1458.8876 1459.8935 1465.0837 1468.1632 1472.6871 1477.0101 1478.2069 1482.1325 1485.6495 1487.8718 1488.7149 1491.8234 1501.6710 1596.8765 1609.0263 2967.1867 2971.2965 2973.8098 2974.3235 2976.1874 2977.9123 2978.6234 2980.7174 2983.4265 2985.9640 2998.0901 3020.9509 3037.1376 3052.2932 3054.3027 3055.4313 3060.8802 3062.5783 3063.6544 3074.8566 3077.8856 3084.2108 3086.9553 3089.8525 3090.2839 3090.8818 3122.1825 3133.8615 3154.4313 3168.1163 3540.6805
redmass: 3.8774 3.7434 4.0301 3.8737 4.1512 3.7433 3.6886 1.1461 1.6931 2.5709 3.0742 2.2355 3.3319 1.3710 1.5254 1.3189 1.3774 3.8190 3.9503 2.1947 1.3002 2.3599 2.4144 2.2376 2.5918 2.4555 2.5802 2.7869 2.4869 1.1381 2.8341 2.4873 3.2281 3.2514 2.6242 2.9977 3.3391 3.5042 4.4068 3.4647 6.4088 3.1318 2.5606 1.8517 4.0502 1.5165 1.8058 2.2374 4.7401 1.7956 1.6435 2.2804 1.8339 1.8800 1.6886 1.4998 1.3711 1.8103 1.5686 1.3321 2.4124 2.6362 1.6709 1.8699 1.3552 1.7805 1.7156 1.5325 2.0709 2.4987 1.8216 1.6918 2.3019 1.9225 2.1487 2.6786 1.1389 2.4648 2.7192 2.1977 1.4738 1.7579 1.6383 2.2844 1.5137 1.5256 3.0133 1.3097 1.4392 1.4789 1.2637 1.3811 1.2137 1.4146 1.5179 1.2487 1.2503 1.3147 2.7759 1.6054 1.2107 1.3034 1.4851 1.9783 1.0785 1.0938 1.0463 1.0600 1.0656 1.0668 1.0676 1.0667 1.2367 1.0582 1.0755 1.2302 1.0642 1.4166 1.2311 1.0696 6.7552 6.3152 1.0766 1.0377 1.0437 1.0587 1.0575 1.0538 1.0373 1.0456 1.0502 1.0446 1.0629 1.1007 1.1012 1.1053 1.1030 1.0964 1.0954 1.0981 1.0980 1.0974 1.0988 1.0996 1.0991 1.0982 1.0998 1.0982 1.0868 1.0889 1.0935 1.0996 1.0654
irintensity: 0.0715 0.0372 0.0092 0.0385 1.1805 0.7035 0.4070 0.3872 2.1513 4.4378 1.7690 0.2715 3.9542 1.2042 0.8083 0.4583 0.8817 1.9726 1.6328 0.7057 1.0756 1.4077 2.6468 1.0935 0.9749 1.0382 3.5927 5.0084 2.8189 133.4320 3.2885 0.8821 9.3445 21.0977 4.6743 6.5628 2.2844 0.1298 0.8306 0.7835 8.1404 6.7776 6.6518 2.6714 19.1311 80.3012 3.2623 1.1926 6.8591 6.1057 3.8357 0.3751 4.1153 20.9011 3.9369 1.5571 3.0566 18.4007 9.8047 1.4587 66.1489 17.8336 7.1756 16.4611 1.9319 45.1530 20.6324 6.5389 15.3809 21.5509 3.2199 26.6457 46.5042 54.3575 40.4465 21.3594 8.4063 16.4261 7.5642 81.6155 12.3045 45.1403 48.5791 79.8305 17.2825 52.1435 45.8235 8.5630 2.3545 13.3027 6.6074 3.4738 6.4859 6.4785 6.8855 12.4724 20.0674 13.9508 12.8606 14.8673 18.5602 1.5219 30.4930 30.9905 3.0159 20.4873 14.4740 0.6643 3.0498 4.4627 12.2860 0.8918 9.2829 12.9479 14.0315 49.3639 11.5668 22.2193 40.1417 10.3028 14.7987 37.6612 36.4620 32.0276 24.1740 39.3153 27.9304 10.5519 26.8674 14.9773 48.2801 82.4635 44.2691 9.4322 16.5987 17.8217 56.6439 23.1773 41.3219 34.6330 25.6812 78.5517 54.8096 33.4490 37.7944 42.9238 28.2996 36.1830 9.2518 11.9074 37.9163 14.8143 11.8095
temp: 298.150 k
press: 1.00000 atm
elementType: 8 8 7 6 6 6 6 6 6 6 6 6 6 6 6 6 6 6 6 6 6 6 1 1 1 1 1 1 1 1 1 1 1 1 1 1 1 1 1 1 1 1 1 1 1 1 1 1 1 1 1 1 1
symmnumber: 1
zpe: 1215305.2 jmol-1
zpe.correction: 0.462885 hartree
zpe.thermalcorrener: 0.486979 hartree
zpe.thermalcorrenthalpy: 0.487924 hartree
zpe.thermalcorrgfe: 0.409536 hartree
zpe.sumelectzpe: -946.051566 hartree
zpe.sumelectthermal: -946.027472 hartree
zpe.sumelectthermalent: -946.026528 hartree
zpe.sumelectthermalfe: -946.104915 hartree
dipole: 1.2214 1.2522 -1.1660
dipole: 2.1022
quadrupole: -126.9516 -132.7973 -142.4406
quadrupole: 2.7811 -0.3036 4.7628
quadrupole: 7.1116 1.2658 -8.3774 2.7811 -0.3036 4.7628
hfenergy: -946.5144512 hartree
pointgroup: C01 [X(C19H31N1O2)]
dipole: -0.4677012 0.6383521 -0.2404576 debye
polarizability: 262.486051|5.2269852|174.1645823|-1.8886143|-18.9282711|214.0310753 unknown
InChI: InChI=1S/C19H31NO2/c1-15-9-6-7-10-17(15)22-14-16(21)13-20-18(2,3)11-8-12-19(20,4)5/h6-7,9-10,16,21H,8,11-14H2,1-5H3
charge 0 multiplicity 1
53 atoms
O  0.291472 -2.653302 1.195467
O  2.085806 -0.598738 0.516283
N  -2.340279 -0.149424 0.222896
C  -2.865386 0.638174 1.404849
C  -2.989403 0.01094 -1.126822
C  -4.325878 1.117438 1.14186
C  -3.50178 1.472446 -1.264395
C  -4.515939 1.906449 -0.176526
C  -1.63889 -1.419817 0.476819
C  -1.946515 1.871266 1.673325
C  -2.922463 -0.211891 2.705881
C  -4.157101 -1.003046 -1.363209
C  -1.943113 -0.191128 -2.26207
C  -0.165911 -1.27755 0.936348
C  0.739648 -0.606704 -0.095124
C  3.151127 -0.052127 -0.226981
C  4.420104 -0.080232 0.423149
C  3.000336 0.49442 -1.523293
C  5.52601 0.458308 -0.271991
C  4.55423 -0.673358 1.810948
C  4.128331 1.024471 -2.191623
C  5.39427 1.00887 -1.570168
H  -4.647945 1.736806 2.001242
H  -4.977442 0.222919 1.143431
H  -3.951788 1.587992 -2.2689
H  -2.615724 2.135552 -1.238653
H  -5.551948 1.76046 -0.536301
H  -4.404162 2.991718 0.006285
H  -2.133363 -2.051516 1.241652
H  -1.6291 -2.028918 -0.44355
H  -2.306077 2.455472 2.543108
H  -0.91293 1.541733 1.884283
H  -1.912537 2.540936 0.797286
H  -1.930586 -0.569459 3.031375
H  -3.327692 0.417174 3.519009
H  -3.590029 -1.085089 2.592006
H  -3.807077 -2.041249 -1.212973
H  -4.998059 -0.827449 -0.671702
H  -4.541967 -0.924893 -2.397962
H  -2.405889 0.0434 -3.238509
H  -1.083767 0.486858 -2.115371
H  -1.568387 -1.228243 -2.320178
H  -0.109053 -0.686783 1.875315
H  0.400271 0.426198 -0.298583
H  0.765886 -1.192679 -1.035686
H  1.267383 -2.606901 1.370957
H  2.023793 0.513108 -2.015826
H  6.508162 0.444621 0.215936
H  5.587564 -0.573469 2.184239
H  3.871701 -0.178025 2.525552
H  4.287063 -1.747173 1.815744
H  4.009779 1.44697 -3.195614
H  6.269641 1.418864 -2.084736
