program: Gaussian 09
title: 000206067
version: EM64L-G09RevD.01
frameworkgroup: C1[X(C16H19NO2)]
method: RPBEPBE
basis: SDD
operation: Freq
keyword: #p
keyword: freq=noraman
keyword: PBEPBE/SDD
title: #p freq=noraman PBEPBE/SDD
converged: YES YES NO NO
title: Mulliken charges:
elementType: O O N C C C C C C C C C C C C C C C C H H H H H H H H H H H H H H H H H H H
charge: -0.409689 -0.245644 -0.331714 0.152273 0.281645 0.323779 0.267053 -0.545465 0.353328 -0.632040 -0.794935 -0.365275 -0.798319 -0.545514 0.465160 -0.430165 -0.819305 0.209259 -0.811444 0.259800 0.230763 0.242202 0.235762 0.258637 0.233266 0.257439 0.239235 0.230575 0.236812 0.237474 0.235090 0.246981 0.248302 0.223520 0.234843 0.225183 0.229836 0.371297
chargesum: 0.00000
title: Mulliken charges with hydrogens summed into heavy atoms:
elementType: O O N C C C C C C C C C C C C C C C C
charge: -0.038392 -0.245644 -0.331714 0.152273 0.281645 0.323779 0.267053 -0.285666 0.353328 -0.159076 -0.067271 -0.107836 -0.091698 -0.308040 0.465160 -0.195075 -0.100503 0.209259 -0.121582
polarizability: 2.45861789e+02 -1.13458332e+01 1.58902053e+02 -6.28791844e+00 -3.16404698e+00 1.48663336e+02
1716.lowfreq: -11.2186 -4.1839 -0.0007 0.0002 0.0006 3.9593 19.6629 23.7655 30.5031
frequency: 19.2522 23.6316 30.0791 37.2897 42.4774 56.1815 62.0726 78.2059 84.6874 106.6579 153.3159 158.2164 197.0143 205.3512 217.7084 232.0481 273.5048 301.8220 332.8753 347.5696 352.2683 399.4271 440.0937 467.4142 495.7612 510.6113 548.2152 558.7990 568.5873 585.2573 618.8730 641.8072 654.4431 662.7386 719.8762 722.7598 746.9790 798.5177 817.7343 843.4514 846.0266 890.1459 916.7402 919.8624 961.0927 971.8240 981.1883 995.7480 1020.8866 1032.5162 1036.2973 1044.0621 1045.6575 1047.5284 1050.6630 1120.1902 1140.1379 1153.6255 1163.7935 1200.0181 1238.6728 1259.2046 1276.9442 1286.5364 1313.9516 1339.4398 1364.8410 1376.3103 1397.7117 1402.8475 1403.3535 1406.9135 1411.8427 1422.4798 1451.9591 1458.2036 1462.4113 1466.2247 1470.2920 1471.3977 1474.8664 1476.3704 1477.0844 1505.9049 1545.9476 1586.0488 1589.6777 1621.9606 1656.7647 2965.4127 2968.6790 2977.8891 2981.8082 3024.6802 3032.4406 3034.6881 3056.5166 3058.4008 3086.4654 3089.8986 3091.4800 3094.4051 3099.0163 3113.8629 3127.9188 3152.8259 3206.0074 3504.1931
redmass: 4.8402 2.5702 1.2805 3.6493 5.2695 2.6873 1.2264 1.0706 3.1916 1.2401 2.8014 3.5089 3.6572 2.8354 3.5224 3.4042 2.5578 3.6482 3.8881 3.9085 4.2510 2.2966 2.7684 3.3421 3.4590 3.1023 4.8824 3.5242 4.3682 2.9851 2.1486 3.5227 4.5016 2.3998 5.0276 4.1965 3.8203 1.4498 1.8797 1.8678 5.2967 1.2933 2.7969 2.0581 1.3632 1.5750 1.5260 4.1820 1.5040 1.7701 1.4967 1.6002 1.6129 1.6587 1.5925 2.6281 1.6911 1.4282 1.7471 1.4255 2.1622 3.0726 1.3666 1.6516 2.2607 5.7269 6.7578 4.0168 1.3056 1.3408 1.3206 2.2036 1.3162 3.5511 1.0912 1.0662 1.0505 1.0675 1.0904 1.1044 1.1029 1.2078 1.1728 2.9014 5.0602 6.5331 6.1608 6.5038 8.2542 1.0388 1.0390 1.0376 1.0377 1.0598 1.0977 1.0976 1.0971 1.0961 1.0989 1.0999 1.0963 1.1022 1.0961 1.0913 1.0882 1.0970 1.0981 1.0638
irintensity: 0.3369 0.0903 0.7856 0.6596 1.5740 0.3096 0.3078 0.4179 0.5213 0.0202 2.1897 0.1238 1.8624 3.0195 0.6408 0.0075 3.1380 1.3822 3.8692 0.9879 0.9295 4.3829 5.9379 1.9191 18.8855 11.4864 1.4511 32.9958 3.0806 6.6245 58.1718 25.4108 5.9798 84.4805 0.4947 8.6340 2.7303 29.7659 26.5136 11.9010 26.5542 2.8728 5.0790 18.9406 0.0926 5.5036 3.1707 8.7961 1.5373 11.9617 29.4028 59.1696 32.9964 61.3538 14.1376 34.3520 16.8007 37.3087 3.8931 3.8052 8.5487 3.9451 4.8983 0.3450 49.0141 17.6763 2.4865 74.4956 8.2608 10.6698 11.8515 10.3571 7.8157 36.7713 22.6013 11.1360 24.4593 9.4715 10.7963 4.2927 6.6271 7.5230 20.3188 122.9301 5.4362 1.0195 3.8434 3.8308 206.0474 57.0794 33.9281 37.7019 19.5624 23.5679 12.9041 26.4521 18.6711 14.2023 18.0995 23.8432 21.1799 10.1577 12.6757 21.5940 15.3834 10.1530 4.0501 16.8077
temp: 298.150 k
press: 1.00000 atm
elementType: 8 8 7 6 6 6 6 6 6 6 6 6 6 6 6 6 6 6 6 1 1 1 1 1 1 1 1 1 1 1 1 1 1 1 1 1 1 1
symmnumber: 1
zpe: 813067.9 jmol-1
zpe.correction: 0.309681 hartree
zpe.thermalcorrener: 0.330175 hartree
zpe.thermalcorrenthalpy: 0.331119 hartree
zpe.thermalcorrgfe: 0.256726 hartree
zpe.sumelectzpe: -824.930441 hartree
zpe.sumelectthermal: -824.909947 hartree
zpe.sumelectthermalent: -824.909003 hartree
zpe.sumelectthermalfe: -824.983397 hartree
dipole: 2.8895 0.6437 0.6378
dipole: 3.0282
quadrupole: -101.5719 -116.8276 -105.0955
quadrupole: -5.3319 -2.3725 -1.9759
quadrupole: 6.2597 -8.9959 2.7362 -5.3319 -2.3725 -1.9759
hfenergy: -825.2401225 hartree
pointgroup: C01 [X(C16H19N1O2)]
dipole: -1.1329758 -0.2588203 0.2623268 debye
polarizability: 246.1582623|-10.0681952|158.8376903|6.3287519|2.936779|148.4312253 unknown
InChI: InChI=1S/C16H19NO2/c1-10-5-6-15(11(2)7-10)17-12(3)8-14(13(17)4)9-16(18)19/h5-8,18H,9H2,1-4H3
charge 0 multiplicity 1
38 atoms
O  5.000699 0.276176 0.940299
O  3.997033 2.186798 0.085937
N  0.009451 -0.573559 -0.268824
C  1.042329 0.24068 -0.779222
C  2.24222 -0.474264 -0.626366
C  0.546473 -1.786511 0.214113
C  -1.383233 -0.19688 -0.195828
C  1.927555 -1.734919 -0.000754
C  -1.867658 0.520263 0.935614
C  3.625237 0.00271 -1.032816
C  0.775459 1.600321 -1.361164
C  -2.254613 -0.551444 -1.247501
C  -0.313883 -2.862347 0.814123
C  -3.240913 0.860902 0.965655
C  -4.133468 0.517025 -0.083176
C  -3.620874 -0.198541 -1.193254
C  -0.937683 0.905669 2.070605
C  4.199579 0.953689 0.007054
C  -5.597422 0.916779 -0.013359
H  2.637142 -2.519439 0.260242
H  3.59107 0.548007 -1.992131
H  4.303452 -0.858724 -1.142768
H  0.285903 2.276938 -0.634254
H  1.726162 2.076792 -1.649595
H  0.119207 1.553471 -2.25165
H  -1.852127 -1.104399 -2.103163
H  0.322631 -3.702033 1.139069
H  -0.880928 -2.507138 1.696721
H  -1.055745 -3.259056 0.094386
H  -3.627178 1.41105 1.833594
H  -4.289542 -0.479412 -2.015155
H  -0.364692 0.035234 2.438442
H  -0.188182 1.650332 1.742412
H  -1.499145 1.337747 2.916146
H  -5.716212 2.014226 -0.093511
H  -6.181651 0.457529 -0.828882
H  -6.054221 0.61083 0.94589
H  5.307569 0.921601 1.634268
