program: Gaussian 09
title: 000206064
version: EM64L-G09RevD.01
frameworkgroup: C1[X(C14H13Cl2NO2)]
method: RPBEPBE
basis: SDD
operation: Freq
keyword: #p
keyword: freq=noraman
keyword: PBEPBE/SDD
title: #p freq=noraman PBEPBE/SDD
converged: YES YES NO NO
title: Mulliken charges:
elementType: Cl Cl O O N C C C C C C C C C C C C C C H H H H H H H H H H H H H
charge: -0.005142 -0.031964 -0.407929 -0.244585 -0.318427 0.160511 0.283559 0.344524 -0.533815 0.540273 -0.632509 -0.797711 -0.798074 -0.300922 -0.331899 0.213535 -0.203653 -0.215434 -0.109264 0.261534 0.232896 0.243108 0.244179 0.270627 0.227856 0.242962 0.242303 0.230348 0.271094 0.283951 0.264185 0.373885
chargesum: 0.00000
title: Mulliken charges with hydrogens summed into heavy atoms:
elementType: Cl Cl O O N C C C C C C C C C C C C C C
charge: -0.005142 -0.031964 -0.034045 -0.244585 -0.318427 0.160511 0.283559 0.344524 -0.272281 0.540273 -0.156505 -0.055049 -0.082461 -0.300922 -0.060806 0.213535 0.080298 0.048751 -0.109264
polarizability: 2.53936721e+02 -1.82450543e+01 1.50036779e+02 -8.12351538e-01 6.83886447e+00 1.43983000e+02
1716.lowfreq: -8.3512 -3.2868 -0.0018 0.0011 0.0023 5.5475 23.9662 24.9739 38.9770
frequency: 23.9491 24.8621 38.9699 48.1789 52.7699 83.7345 104.5081 128.1271 139.2959 149.9168 164.7163 170.0650 201.5673 221.0829 227.4770 276.0117 306.0601 335.6841 340.4762 373.2467 395.5832 441.5257 476.6490 480.2159 508.1938 518.5913 559.8655 571.6370 606.8916 627.2867 642.3794 656.8020 666.2940 707.0714 742.8195 763.3904 802.7013 818.4128 842.6033 847.7121 866.0369 918.7245 959.4648 971.6068 987.1735 1033.3857 1039.8836 1045.5696 1050.1879 1054.7159 1080.5040 1128.2150 1136.0903 1153.9820 1200.4408 1238.0807 1258.9915 1280.5819 1315.3881 1330.7209 1349.9392 1364.8135 1383.4274 1404.6825 1409.9137 1418.5537 1450.3507 1464.3782 1466.2215 1473.0498 1475.8221 1479.7233 1550.0635 1564.8806 1592.2713 1597.6166 1656.3985 2966.2840 2968.2284 3026.3707 3037.0541 3038.3391 3093.3753 3095.1922 3097.9830 3156.7339 3180.4253 3182.6445 3208.3062 3504.7231
redmass: 9.2112 8.6635 9.5918 4.3912 5.4141 7.3481 1.0616 1.3370 3.3948 2.7868 7.0434 6.0848 4.8976 3.8838 3.7022 4.5925 4.4221 5.1875 5.1834 10.4774 2.3319 3.0808 5.1775 5.1276 4.2581 4.2295 3.4613 3.4005 2.5742 4.2037 3.5637 2.4430 5.2068 4.1355 4.4183 7.4979 1.4833 1.6528 2.2641 5.1750 1.4120 1.9940 1.3596 1.7362 4.1352 1.7482 1.5791 1.8922 1.5794 2.3458 2.7660 2.8857 1.4220 1.4402 1.4564 1.4873 2.4618 1.3477 2.4090 4.9166 5.2410 4.3259 3.8657 1.3280 1.3533 3.0541 1.0926 1.0580 1.2218 1.9613 1.0890 1.3555 5.4623 8.6190 7.3657 6.4800 8.2624 1.0397 1.0387 1.0599 1.0970 1.0981 1.0961 1.1006 1.0981 1.0898 1.0953 1.0952 1.0982 1.0638
irintensity: 0.3636 0.3525 0.9369 0.0446 1.6797 0.8544 0.1538 0.8667 0.3749 0.6694 0.5163 0.6143 1.9077 1.0471 0.2969 1.8221 0.5620 1.4941 0.8520 2.4872 5.0996 9.7923 22.5609 22.1279 3.9644 7.0890 33.5360 10.1783 32.8604 3.5026 39.5499 89.8228 25.0362 6.8442 5.1426 44.3886 39.9350 24.9681 8.7189 22.2562 19.2231 20.7274 0.1740 9.1374 17.2656 6.6786 26.6141 67.7609 38.8856 72.4849 43.6495 46.7976 2.3739 34.1516 4.9635 0.5252 2.9815 5.5682 47.4905 18.9458 10.8750 37.9085 29.7724 26.2977 2.9437 11.1738 20.8378 11.0418 60.1410 247.4681 7.1875 29.3636 6.3566 19.2535 7.1049 5.7266 210.8857 49.9048 38.2641 21.7196 8.2059 23.8019 19.1587 11.0875 5.1943 2.3690 0.1200 1.5182 3.2593 19.1992
temp: 298.150 k
press: 1.00000 atm
elementType: 17 17 8 8 7 6 6 6 6 6 6 6 6 6 6 6 6 6 6 1 1 1 1 1 1 1 1 1 1 1 1 1
symmnumber: 1
zpe: 620831.0 jmol-1
zpe.correction: 0.236462 hartree
zpe.thermalcorrener: 0.255649 hartree
zpe.thermalcorrenthalpy: 0.256593 hartree
zpe.thermalcorrgfe: 0.186092 hartree
zpe.sumelectzpe: -1665.245641 hartree
zpe.sumelectthermal: -1665.226454 hartree
zpe.sumelectthermalent: -1665.225510 hartree
zpe.sumelectthermalfe: -1665.296011 hartree
dipole: 1.0736 0.7078 -1.8252
dipole: 2.2327
quadrupole: -126.0459 -125.0393 -119.3329
quadrupole: -4.3181 -1.3773 5.5658
quadrupole: -2.5732 -1.5667 4.1398 -4.3181 -1.3773 5.5658
hfenergy: -1665.4821031 hartree
pointgroup: C01 [X(C14H13Cl2N1O2)]
dipole: -0.4494116 -0.6844952 -0.3179735 debye
polarizability: 253.9763146|-15.5792205|141.0509937|9.8297874|-3.2603017|152.929192 unknown
InChI: InChI=1S/C14H13Cl2NO2/c1-8-5-10(6-14(18)19)9(2)17(8)13-4-3-11(15)7-12(13)16/h3-5,7,18H,6H2,1-2H3
charge 0 multiplicity 1
32 atoms
Cl -0.985536 0.68438 2.507666
Cl -5.851794 0.942119 -0.127186
O  5.035992 0.378022 0.741154
O  4.049873 2.1817 -0.338138
N  0.029684 -0.566885 -0.152736
C  1.044241 0.177342 -0.80174
C  2.239333 -0.536787 -0.633299
C  0.579273 -1.73683 0.423687
C  1.944027 -1.724727 0.130786
C  -1.354763 -0.204286 -0.12734
C  3.606382 -0.120626 -1.146732
C  0.772031 1.496549 -1.468597
C  -0.257403 -2.734257 1.171826
C  -1.967856 0.365689 1.017134
C  -2.156145 -0.407305 -1.278224
C  4.226354 0.945049 -0.25369
C  -3.33319 0.715222 1.034371
C  -3.522977 -0.06009 -1.296813
C  -4.089809 0.493828 -0.132232
H  2.659498 -2.487631 0.435425
H  3.535544 0.30591 -2.162301
H  4.276276 -0.994949 -1.178444
H  0.243579 2.194793 -0.791979
H  1.725652 1.976374 -1.741343
H  0.156496 1.396895 -2.384028
H  0.363236 -3.606229 1.435788
H  -0.664245 -2.315953 2.112733
H  -1.114218 -3.099691 0.573357
H  -1.688558 -0.852988 -2.161736
H  -3.785321 1.153572 1.927329
H  -4.131662 -0.222635 -2.190001
H  5.371906 1.099726 1.340002
