program: Gaussian 09
title: 000206063
version: EM64L-G09RevD.01
frameworkgroup: C1[X(C14H13Cl2NO2)]
method: RPBEPBE
basis: SDD
operation: Freq
keyword: #p
keyword: freq=noraman
keyword: PBEPBE/SDD
title: #p freq=noraman PBEPBE/SDD
converged: YES YES NO NO
title: Mulliken charges:
elementType: Cl Cl O O N C C C C C C C C C C C C C C H H H H H H H H H H H H H
charge: 0.033114 -0.006322 -0.408115 -0.243882 -0.325705 0.159162 0.286561 0.344769 -0.533990 0.546319 -0.633484 -0.796476 -0.797933 -0.283803 -0.369087 0.213184 -0.083124 -0.204930 -0.241001 0.261215 0.232491 0.242648 0.246267 0.266948 0.228729 0.242634 0.243680 0.230431 0.269709 0.242662 0.263462 0.373866
chargesum: 0.00000
title: Mulliken charges with hydrogens summed into heavy atoms:
elementType: Cl Cl O O N C C C C C C C C C C C C C C
charge: 0.033114 -0.006322 -0.034249 -0.243882 -0.325705 0.159162 0.286561 0.344769 -0.272774 0.546319 -0.158345 -0.054531 -0.081188 -0.283803 -0.099379 0.213184 -0.083124 0.037732 0.022461
polarizability: 2.29643631e+02 5.66600315e-01 1.61162559e+02 1.49359944e+01 1.08768397e+01 1.50311808e+02
1716.lowfreq: -5.5134 -0.0033 -0.0030 -0.0023 0.0432 3.4123 18.4352 22.7209 38.8559
frequency: 18.0388 22.6204 38.8518 43.9320 54.2354 76.0572 84.7779 114.0363 120.4490 141.7745 189.2158 195.7893 209.2167 225.3788 231.3724 272.8150 285.8781 314.3670 337.3402 390.7239 399.2205 450.8153 466.2644 499.3484 507.4490 511.3144 559.3772 585.3047 600.1935 626.6655 638.9468 657.6344 709.9890 711.9630 741.3551 747.1764 790.4273 804.6591 840.6919 846.9196 912.1203 920.2550 975.2627 979.4539 999.9303 1033.9769 1038.2226 1040.7459 1047.9998 1050.0010 1097.4806 1132.2101 1149.8882 1155.5363 1191.2197 1204.3908 1260.4569 1278.4498 1314.8464 1331.6930 1352.0769 1370.1817 1403.5807 1407.7818 1410.8831 1419.6056 1452.3922 1456.2866 1462.6283 1464.6987 1476.1833 1477.6537 1550.3915 1562.9755 1590.8188 1597.4346 1657.3687 2967.1225 2968.5591 3026.1274 3036.0360 3038.2534 3094.2276 3094.9824 3098.9594 3150.4475 3166.2154 3180.6715 3209.2013 3505.7195
redmass: 7.4649 6.8156 8.7669 4.7833 6.8755 1.1991 3.9684 2.3443 1.6719 2.6964 6.0361 8.0416 4.6617 3.8158 3.3942 4.4314 5.2823 5.8993 4.7308 6.1194 2.5197 7.7311 3.3726 6.0848 3.6531 3.9844 3.3982 3.9887 3.3130 3.3413 3.3514 2.2531 6.1692 4.0997 3.4193 6.0708 1.5747 1.4569 2.9438 5.1497 1.3738 1.9907 1.5685 1.3473 6.6556 1.7221 2.2516 2.1097 1.7464 1.6991 1.9656 2.8650 1.5858 1.4604 1.4245 1.4004 2.9238 1.3513 2.3968 4.8983 10.4484 3.3450 1.4051 2.2862 1.4066 3.0520 1.1100 2.4082 1.1427 1.1411 1.0674 1.2344 5.4935 6.8405 7.3106 6.3925 8.2782 1.0392 1.0387 1.0597 1.0978 1.0980 1.0961 1.1022 1.0962 1.0873 1.0932 1.0995 1.0982 1.0638
irintensity: 0.6900 0.4070 1.8222 0.4793 0.2432 0.3980 0.4302 0.1577 0.5740 1.3526 1.4401 0.9686 0.9242 0.6528 0.3387 1.9313 2.8606 0.5962 2.6488 4.6996 2.8261 7.7292 1.8632 11.6324 21.5302 2.3021 32.6956 7.8763 30.2269 11.6924 34.8208 94.6066 12.4319 13.7684 4.1471 48.1095 57.4861 32.6225 4.1768 25.0026 0.0253 22.1487 0.9100 0.2833 10.7260 11.2103 14.7895 4.4354 92.6608 80.6959 11.6221 42.2081 16.5296 28.6821 11.5757 1.7503 10.6732 5.1322 46.3403 23.2798 0.4870 50.8329 24.6235 34.9331 9.1891 6.7282 16.0966 175.8081 21.6195 34.8725 9.5842 3.0720 15.3247 18.1276 28.7816 6.0200 213.0923 52.1413 34.3500 22.2608 11.3011 20.9920 18.6083 9.4610 8.5950 4.3587 2.5844 5.1052 3.2908 18.9774
temp: 298.150 k
press: 1.00000 atm
elementType: 17 17 8 8 7 6 6 6 6 6 6 6 6 6 6 6 6 6 6 1 1 1 1 1 1 1 1 1 1 1 1 1
symmnumber: 1
zpe: 621018.5 jmol-1
zpe.correction: 0.236533 hartree
zpe.thermalcorrener: 0.255771 hartree
zpe.thermalcorrenthalpy: 0.256715 hartree
zpe.thermalcorrgfe: 0.185569 hartree
zpe.sumelectzpe: -1665.241942 hartree
zpe.sumelectthermal: -1665.222705 hartree
zpe.sumelectthermalent: -1665.221761 hartree
zpe.sumelectthermalfe: -1665.292907 hartree
dipole: -1.7393 -3.1523 -0.0373
dipole: 3.6005
quadrupole: -118.6950 -119.2236 -123.6349
quadrupole: 7.4895 8.5399 6.6618
quadrupole: 1.8228 1.2943 -3.1171 7.4895 8.5399 6.6618
hfenergy: -1665.4784758 hartree
pointgroup: C01[X(C14H13Cl2N1O2)]
dipole: -0.8153499 -1.0912553 -0.3885535 debye
polarizability: 230.5306342|-10.0488004|153.6966859|8.3388857|11.4862594|156.890678 unknown
InChI: InChI=1S/C14H13Cl2NO2/c1-8-6-10(7-13(18)19)9(2)17(8)12-5-3-4-11(15)14(12)16/h3-6,18H,7H2,1-2H3
charge 0 multiplicity 1
32 atoms
Cl -1.174537 1.621568 1.675144
Cl -4.353928 2.154933 1.146485
O  4.829916 0.852013 0.730603
O  3.950475 1.900756 -1.144857
N  -0.032826 -0.688002 0.009439
C  1.019481 -0.255321 -0.832397
C  2.208707 -0.752732 -0.279599
C  0.485934 -1.444523 1.086778
C  1.870322 -1.489431 0.914147
C  -1.42084 -0.416018 -0.216261
C  3.606973 -0.535542 -0.829436
C  0.779226 0.610124 -2.037025
C  -0.394203 -2.042035 2.146608
C  -2.09397 0.615889 0.492657
C  -2.138542 -1.181206 -1.165607
C  4.124298 0.853345 -0.481815
C  -3.465643 0.853374 0.252184
C  -3.505378 -0.930068 -1.406613
C  -4.176438 0.086808 -0.693877
H  2.570934 -1.996332 1.576581
H  3.620019 -0.622379 -1.929769
H  4.294303 -1.287699 -0.409568
H  0.258438 1.549543 -1.769336
H  1.743686 0.898035 -2.485173
H  0.170569 0.104971 -2.812065
H  0.218099 -2.660585 2.823126
H  -0.893077 -1.267908 2.761387
H  -1.18598 -2.689141 1.722167
H  -1.606251 -1.974241 -1.699587
H  -4.053795 -1.526675 -2.141782
H  -5.237484 0.290329 -0.863818
H  5.096615 1.785346 0.95428
