program: Gaussian 09
title: 000213718
version: EM64L-G09RevD.01
frameworkgroup: C1[X(C16H20ClNO)]
method: RPBEPBE
basis: SDD
operation: Freq
keyword: #p
keyword: freq=noraman
keyword: PBEPBE/SDD
title: #p freq=noraman PBEPBE/SDD
converged: NO YES NO NO
title: Mulliken charges:
elementType: Cl O N C C C C C C C C C C C C C C C C H H H H H H H H H H H H H H H H H H H H
charge: -0.068492 -0.272569 -0.616141 0.034059 -0.546794 -0.546105 0.410750 -0.158517 0.186942 -0.436975 -0.435077 0.599675 -0.411461 -0.402442 -0.387160 -0.426777 -0.458007 -0.383232 -0.387262 0.240483 0.277386 0.277149 0.241668 0.221656 0.210587 0.179190 0.200875 0.227342 0.197130 0.200948 0.203902 0.198221 0.190358 0.202181 0.277307 0.252834 0.236718 0.329083 0.340567
chargesum: 0.00000
title: Mulliken charges with hydrogens summed into heavy atoms:
elementType: Cl O N C C C C C C C C C C C C C C C C
charge: -0.068492 -0.272569 0.053510 0.034059 -0.028925 -0.027288 0.410750 0.063139 0.186942 -0.047198 -0.006860 0.599675 -0.013383 -0.000319 0.005379 -0.149470 -0.205174 -0.383232 -0.150543
polarizability: 2.58022310e+02 4.56172416e+00 1.69644110e+02 -9.67024846e+00 -2.97327358e+00 1.44308300e+02
1716.lowfreq: -1.3560 0.0021 0.0022 0.0026 5.6548 11.8399 23.9247 36.4244 43.5466
frequency: 23.4890 36.3399 43.1260 53.0238 79.9129 98.5451 126.4945 156.3209 177.5367 197.1822 232.6148 244.0680 260.3869 267.6291 303.9911 330.1164 374.0979 390.8841 405.4899 433.3150 443.8398 448.0245 459.3223 495.6391 504.6862 526.7868 588.0833 596.9377 623.1426 654.3095 701.3927 724.6472 734.3897 768.8304 788.8956 800.5505 822.7691 835.7860 848.5513 867.5942 884.5859 892.1172 895.6675 898.0940 922.0468 948.1556 962.3103 970.3536 990.6161 1028.9300 1047.8691 1055.0098 1056.7818 1071.1992 1074.5718 1091.9678 1103.9719 1113.0710 1123.8638 1150.0711 1182.4694 1183.5330 1204.9176 1211.3401 1233.5914 1255.3246 1258.2790 1275.8077 1299.4158 1303.3753 1319.6338 1334.2217 1334.8945 1341.6218 1342.5084 1348.1255 1354.2126 1371.2268 1388.7876 1426.2124 1449.5102 1459.6860 1461.4065 1465.3625 1469.1745 1475.6944 1486.4752 1546.7792 1576.3451 1610.4857 1631.1175 2962.5334 2965.7573 2966.7548 2967.9420 2969.3607 2981.1655 3026.1186 3028.5739 3032.3881 3038.6542 3047.2043 3099.9301 3106.9521 3133.6426 3154.9715 3158.9656 3207.3421 3223.1967 3517.4445 3672.4390
redmass: 4.9524 3.7781 4.4964 5.9400 3.7600 4.7086 5.2252 4.3884 4.1230 3.9250 2.2119 3.5044 2.9699 2.5765 3.3948 2.9551 3.2398 5.0801 3.7324 3.1035 3.6474 3.2565 3.6582 1.6651 3.2178 1.1968 3.7073 1.2867 4.0277 5.4571 4.1838 5.1040 4.1792 2.3142 1.4513 1.1900 2.4376 1.6347 1.6945 2.1002 6.5445 1.8233 1.4842 1.7493 2.0093 4.3551 1.2165 1.3819 2.5388 2.9062 1.8202 1.8359 1.2977 1.3264 1.2007 1.3668 1.9149 2.4092 2.0821 1.6245 1.2852 1.4515 1.9255 3.1629 1.4056 1.3248 1.2888 1.4994 1.2999 1.3610 1.3653 2.5075 1.4344 1.7880 1.6749 1.5710 4.4073 1.9667 3.8819 1.0877 1.2976 1.0897 1.0885 1.0890 1.0814 1.1001 3.2708 6.6199 1.5406 7.1471 3.1475 1.0636 1.0631 1.0659 1.0634 1.0627 1.0753 1.0974 1.0951 1.1016 1.1014 1.1027 1.0503 1.0614 1.0877 1.0928 1.0950 1.1176 1.1163 1.0444 1.1045
irintensity: 0.0583 0.0901 0.7448 10.0560 0.5626 1.0021 0.2195 0.3589 1.3274 0.6034 1.0926 3.7400 0.0884 0.2008 4.2325 2.5668 2.6140 3.1633 12.9552 0.3349 2.2951 9.7850 1.9627 3.1007 0.6012 132.0606 3.9053 64.6770 21.7782 2.6027 16.1153 26.0571 7.2281 2.1861 0.1161 3.0353 0.2890 9.6599 29.3364 10.3692 3.8505 2.2986 12.9919 1.7939 0.4669 34.4026 1.4555 1.2849 21.5535 16.6988 0.7134 0.1050 0.8030 2.6730 22.5678 8.0619 3.5335 0.2157 4.1698 2.7431 0.6297 3.2313 4.5655 13.1228 1.5115 1.9787 1.1357 1.1709 4.7796 6.8384 3.4449 25.2966 3.9573 1.0339 1.4403 2.7777 179.3188 1.7297 12.9118 12.2492 26.9803 4.1235 6.2698 9.5143 20.5735 3.4258 43.7494 15.7929 157.3057 21.4206 219.3078 25.9141 32.6135 26.6339 19.2228 27.7227 29.5277 80.2188 79.0365 2.8836 29.7783 90.9567 10.4240 7.6427 7.7097 5.5691 7.0684 0.0798 8.1561 28.7757 52.6987
temp: 298.150 k
press: 1.00000 atm
elementType: 17 8 7 6 6 6 6 6 6 6 6 6 6 6 6 6 6 6 6 1 1 1 1 1 1 1 1 1 1 1 1 1 1 1 1 1 1 1 1
symmnumber: 1
zpe: 853014.4 jmol-1
zpe.correction: 0.324896 hartree
zpe.thermalcorrener: 0.343032 hartree
zpe.thermalcorrenthalpy: 0.343976 hartree
zpe.thermalcorrgfe: 0.277357 hartree
zpe.sumelectzpe: -1210.325728 hartree
zpe.sumelectthermal: -1210.307593 hartree
zpe.sumelectthermalent: -1210.306649 hartree
zpe.sumelectthermalfe: -1210.373267 hartree
dipole: 3.9454 -1.6648 -0.2321
dipole: 4.2885
quadrupole: -143.5515 -119.7298 -114.3585
quadrupole: -4.3018 -0.1692 1.3052
quadrupole: -17.6716 6.1501 11.5214 -4.3018 -0.1692 1.3052
hfenergy: -1210.6506244 hartree
pointgroup: C01 [X(C16H20Cl1N1O1)]
dipole: 1.5394846 -0.5950101 -0.3502541 debye
polarizability: 257.9054166|6.8241404|168.1341811|-9.2243419|6.3705261|145.9351217 unknown
InChI: InChI=1S/C16H20ClNO/c17-14-10-12(16(8-9-16)15(18)19)6-7-13(14)11-4-2-1-3-5-11/h6-7,10-11H,1-5,8-9,18H2
charge 0 multiplicity 1
39 atoms
Cl 1.086548 2.935665 0.404911
O  -5.440994 0.107846 -0.657793
N  -3.506119 0.375436 -1.909895
C  -3.304894 -0.030035 0.519655
C  -3.916745 -0.982578 1.575549
C  -3.944933 0.52027 1.817799
C  -1.808445 0.021557 0.351296
C  2.571504 0.213086 -0.221869
C  -4.173822 0.154241 -0.719518
C  3.158752 -0.855805 -1.179562
C  3.2798 0.12583 1.167173
C  1.056501 0.148356 -0.057461
C  4.686954 -0.672155 -1.338423
C  4.811064 0.291661 1.023267
C  5.405911 -0.735177 0.030422
C  -1.115702 1.255669 0.446881
C  -1.059004 -1.143211 0.04681
C  0.275962 1.292076 0.24884
C  0.335772 -1.074473 -0.149543
H  -3.218041 -1.587858 2.160367
H  -4.860922 -1.459967 1.300855
H  -4.907515 1.025288 1.702345
H  -3.2655 0.937207 2.56701
H  2.821238 1.20869 -0.643502
H  2.658496 -0.799805 -2.166107
H  2.970438 -1.872244 -0.776297
H  3.047895 -0.859059 1.622794
H  2.872671 0.900489 1.843495
H  4.890402 0.309337 -1.814789
H  5.090408 -1.447283 -2.018435
H  5.294096 0.190908 2.014507
H  5.030525 1.318257 0.663668
H  5.295995 -1.756051 0.452218
H  6.491015 -0.557495 -0.09911
H  -1.663597 2.173555 0.681615
H  -1.57645 -2.106294 -0.028259
H  0.8860 -1.991101 -0.384404
H  -4.05985 0.507394 -2.755271
H  -2.489114 0.414776 -1.955439
