program: Gaussian 09
title: 000213730
version: EM64L-G09RevD.01
frameworkgroup: C1[X(C17H23FN2O3)]
method: RPBEPBE
basis: SDD
operation: Freq
keyword: #p
keyword: freq=noraman
keyword: PBEPBE/SDD
title: #p freq=noraman PBEPBE/SDD
converged: YES YES NO NO
title: Mulliken charges:
elementType: F O O O N N C C C C C C C C C C C C C C C C C H H H H H H H H H H H H H H H H H H H H H H H
charge: -0.197166 -0.316199 -0.310973 -0.227392 -0.101697 -0.143116 -0.344502 -0.345712 -0.396419 -0.390920 -0.346771 -0.446283 -0.506620 0.313567 0.118612 0.293829 -0.247084 -0.309469 -0.319478 -0.665692 -0.386657 -0.371459 0.332461 0.223969 0.192989 0.193426 0.212992 0.215188 0.256311 0.253522 0.217826 0.200216 0.195758 0.222024 0.236910 0.226473 0.270785 0.215950 0.235153 0.253724 0.284242 0.220947 0.252246 0.213469 0.259324 0.261695
chargesum: 0.00000
title: Mulliken charges with hydrogens summed into heavy atoms:
elementType: F O O O N N C C C C C C C C C C C C C C C C C
charge: -0.197166 -0.316199 -0.310973 -0.227392 -0.101697 -0.143116 0.072456 0.060705 0.075080 0.080428 0.049204 0.012652 -0.009362 0.313567 0.118612 0.293829 0.204019 -0.055744 -0.035235 0.020970 -0.127332 -0.109764 0.332461
polarizability: 2.71848049e+02 -2.06894616e+01 1.78563197e+02 -5.11673319e+00 -1.48528515e+01 1.85917081e+02
1716.lowfreq: -7.3410 -3.7070 -0.0008 -0.0008 -0.0006 3.0941 10.4351 17.5591 19.5550
frequency: 10.4313 17.1805 19.5248 29.0847 44.6381 58.8318 78.7680 87.8699 97.8338 112.6659 118.8805 139.0074 172.8534 206.2940 229.7818 234.7556 258.7167 266.9574 285.6357 299.4294 316.0793 324.1848 344.1097 374.6434 397.3256 411.2573 413.7897 462.5168 470.5761 480.5201 495.3996 506.1263 549.7212 570.4667 582.7715 624.0784 625.3311 691.6212 715.1508 727.7077 736.6536 755.1720 796.3846 807.6730 811.7376 821.6549 838.9649 840.3559 849.4520 881.4566 936.6903 946.0888 959.6041 974.0340 989.9824 995.0523 1006.3265 1018.6500 1030.2228 1049.8941 1064.0876 1066.7269 1088.4405 1095.0645 1105.2289 1105.6232 1123.3441 1136.6894 1153.0656 1155.7620 1168.5816 1193.4117 1199.8428 1202.6050 1214.9466 1226.3435 1258.2331 1269.6471 1278.2246 1283.5560 1288.7441 1291.3429 1312.1523 1329.9483 1342.4306 1350.5568 1355.4137 1365.3704 1368.1319 1380.7468 1386.3334 1387.3703 1409.7770 1410.2804 1439.1496 1455.3324 1456.1269 1460.1160 1462.2980 1463.2586 1467.8056 1475.0984 1477.2369 1484.7345 1490.8841 1569.8858 1600.5794 1612.3246 1639.5926 2859.4800 2860.0511 2874.1861 2949.0263 2971.4297 2975.1594 2989.7013 3002.9986 3005.3909 3012.8445 3027.2674 3035.1281 3053.5394 3067.9049 3083.8623 3090.0390 3094.1319 3116.1255 3119.1353 3155.7140 3157.8045 3177.6134 3180.6959
redmass: 5.9669 5.1414 4.3540 4.4897 4.9967 2.5701 4.4957 5.4186 6.1446 5.5515 4.1054 2.4494 3.3373 1.6799 2.0594 3.5197 1.9134 3.2299 6.1105 3.4792 2.3610 3.2404 3.9552 6.5526 2.4047 2.9470 2.7146 3.7766 3.1099 3.2468 3.4587 3.8998 3.3495 2.2217 6.3357 2.5769 7.0332 11.2365 2.2444 3.3168 3.0232 5.2918 1.7170 1.3425 5.5922 1.3098 1.8297 2.3595 1.5733 2.0835 2.4486 1.8000 1.5637 2.5917 1.3641 3.5084 2.4096 2.4337 2.7570 1.7805 2.6054 2.2443 2.2124 2.1338 1.9723 1.6631 1.8127 2.6492 1.6697 1.4055 1.9987 1.4944 1.2306 2.1486 1.9868 2.1543 2.0270 1.1576 1.5018 1.1636 1.3737 1.3125 1.5260 1.3332 1.2792 1.2951 1.5559 1.4106 1.3662 5.9001 1.2710 1.4190 3.6774 2.7034 1.1028 1.0898 1.1030 1.0786 1.0482 1.0954 1.1001 1.0841 1.0983 1.0536 2.5932 7.9794 7.2967 7.1468 9.1110 1.0714 1.0701 1.0692 1.0625 1.0693 1.0682 1.0360 1.0863 1.0889 1.0705 1.0590 1.0897 1.0896 1.0991 1.0978 1.1031 1.0946 1.1056 1.0925 1.0883 1.0890 1.0964 1.0974
irintensity: 0.0227 1.0239 1.4397 0.0604 0.6091 0.5785 2.2896 0.7614 5.8751 0.2602 0.4256 0.9631 6.1002 3.5486 3.0889 10.4791 1.0617 2.7112 0.9337 1.4895 11.5832 15.2920 8.6664 3.1237 2.6578 0.0237 4.1901 3.1598 0.8324 6.8055 3.3319 2.9537 21.3864 8.7420 26.7800 1.8806 0.4253 16.5247 14.0964 7.1667 19.3082 1.9106 33.6331 2.4790 15.3662 3.1235 1.8677 4.0382 59.6431 25.9958 28.6741 3.2381 6.1515 43.4112 0.8173 21.8407 7.9326 18.8719 99.6110 16.9196 80.3829 40.7031 23.0326 32.4055 21.8452 30.7270 20.4297 86.7906 44.1861 82.6888 15.5068 7.7196 3.2962 22.7897 188.8654 240.7181 63.5462 14.8260 26.8555 17.2100 59.3052 18.7301 99.2098 6.4383 6.6308 18.0941 37.5370 2.6545 1.7886 18.5391 39.3741 2.4496 49.4888 94.9777 17.4976 30.2501 31.8276 16.2662 17.7777 3.0629 10.1105 24.0942 10.9101 17.1930 26.5020 110.4680 73.9296 66.6880 441.3024 40.7546 26.9109 247.1332 77.3358 24.4663 78.9281 21.5201 20.5900 11.6549 23.7426 40.7189 46.8882 35.3799 39.8533 39.1654 4.4098 5.8718 33.2698 4.2708 6.5095 0.0697 4.2380 4.3442
temp: 298.150 k
press: 1.00000 atm
elementType: 9 8 8 8 7 7 6 6 6 6 6 6 6 6 6 6 6 6 6 6 6 6 6 1 1 1 1 1 1 1 1 1 1 1 1 1 1 1 1 1 1 1 1 1 1 1
symmnumber: 1
zpe: 990987.9 jmol-1
zpe.correction: 0.377447 hartree
zpe.thermalcorrener: 0.400344 hartree
zpe.thermalcorrenthalpy: 0.401288 hartree
zpe.thermalcorrgfe: 0.320624 hartree
zpe.sumelectzpe: -1094.878324 hartree
zpe.sumelectthermal: -1094.855428 hartree
zpe.sumelectthermalent: -1094.854484 hartree
zpe.sumelectthermalfe: -1094.935148 hartree
dipole: -0.2425 1.0330 0.6540
dipole: 1.2464
quadrupole: -151.2303 -139.3405 -134.4610
quadrupole: -1.6817 15.0588 8.4146
quadrupole: -9.5530 2.3368 7.2162 -1.6817 15.0588 8.4146
hfenergy: -1095.2557717 hartree
pointgroup: C01 [X(C17H23F1N2O3)]
dipole: 0.107741 0.4751208 -0.055957 debye
polarizability: 272.0274802|18.4948105|167.7043747|8.0213746|7.561115|196.5964716 unknown
InChI: InChI=1S/C17H23FN2O3/c1-2-23-17(22)20-12-10-19(11-13-20)9-3-4-16(21)14-5-7-15(18)8-6-14/h5-8H,2-4,9-13H2,1H3
charge 0 multiplicity 1
46 atoms
F  -6.965685 -2.053866 -1.833238
O  5.017138 -1.699093 0.623873
O  5.566146 -0.70552 -1.44084
O  -2.965213 0.864626 2.239818
N  1.265998 1.410334 -0.043144
N  3.455088 -0.398868 -0.461412
C  1.844744 0.650876 1.095991
C  2.319209 1.715228 -1.046931
C  2.475241 -0.668587 0.60813
C  2.947848 0.415367 -1.581629
C  0.521408 2.624389 0.384391
C  -0.806432 2.29249 1.099119
C  -1.732433 1.43915 0.214898
C  4.73601 -0.907339 -0.510122
C  -2.891461 0.798548 0.975394
C  -3.947484 0.05913 0.197693
C  6.400664 -2.249745 0.679833
C  -3.883014 -0.111061 -1.212326
C  -5.045312 -0.4969 0.911474
C  7.377198 -1.232565 1.277792
C  -4.88947 -0.819425 -1.900773
C  -6.061444 -1.204312 0.243119
C  -5.956787 -1.348006 -1.153372
H  1.04636 0.412544 1.820216
H  2.621761 1.256014 1.629317
H  3.126852 2.358214 -0.613802
H  1.858742 2.267155 -1.887303
H  1.672949 -1.32441 0.211578
H  2.980395 -1.18782 1.434785
H  3.788995 0.629912 -2.26009
H  2.178029 -0.160187 -2.135207
H  1.144552 3.273894 1.049717
H  0.306322 3.214209 -0.528817
H  -1.306896 3.239621 1.376278
H  -0.626627 1.765026 2.052655
H  -2.131685 2.042646 -0.625342
H  -1.118296 0.640431 -0.255485
H  6.295591 -3.145031 1.314306
H  6.705635 -2.539628 -0.340897
H  -3.045082 0.302103 -1.781743
H  -5.074491 -0.358547 1.996931
H  7.041031 -0.901258 2.275836
H  7.469991 -0.353853 0.617864
H  8.377846 -1.692021 1.384732
H  -4.857055 -0.96395 -2.9843
H  -6.913379 -1.636518 0.77554
