program: Gaussian 09
title: 000206056
version: EM64L-G09RevD.01
frameworkgroup: C1[X(C21H21NO2)]
method: RPBEPBE
basis: SDD
operation: Freq
keyword: #p
keyword: freq=noraman
keyword: PBEPBE/SDD
title: #p freq=noraman PBEPBE/SDD
converged: YES YES NO NO
title: Mulliken charges:
elementType: O O N C C C C C C C C C C C C C C C C C C C C C H H H H H H H H H H H H H H H H H H H H H
charge: -0.410589 -0.243863 -0.267400 -0.334287 0.217372 0.388245 0.255702 0.427245 0.396954 -0.574421 -0.812653 -0.637270 -0.823858 -0.369724 -0.388019 -0.384835 -0.385482 -0.240181 -0.246228 -0.245948 -0.250947 0.208149 -0.241096 -0.241232 0.230231 0.260742 0.257945 0.247620 0.248922 0.232660 0.244629 0.223380 0.245975 0.242741 0.245179 0.245312 0.258861 0.275573 0.227465 0.228106 0.227875 0.230598 0.229618 0.229774 0.371156
chargesum: 0.00000
title: Mulliken charges with hydrogens summed into heavy atoms:
elementType: O O N C C C C C C C C C C C C C C C C C C C C C
charge: -0.039433 -0.243863 -0.267400 -0.104055 0.217372 0.388245 0.255702 0.427245 0.396954 -0.313679 -0.058166 -0.159981 -0.111762 -0.124546 -0.142707 -0.125975 -0.109909 -0.012716 -0.018122 -0.018072 -0.020349 0.208149 -0.011478 -0.011457
polarizability: 2.54303239e+02 5.78697525e+00 2.37885160e+02 1.44572110e+01 -9.96043501e+00 1.97689407e+02
1716.lowfreq: -5.8269 -3.9529 -0.0001 0.0005 0.0007 4.8246 20.1206 27.3706 30.1005
frequency: 20.0631 27.3560 29.9456 33.8890 42.4375 56.2708 65.8715 80.2088 91.5731 142.6414 175.2274 178.5602 192.5888 209.2874 217.7659 229.3794 248.8559 255.2283 284.1464 312.0335 324.9906 371.4841 399.7992 400.6136 405.8234 453.1718 478.6747 506.6006 507.1232 560.2666 589.9439 592.1852 615.6690 616.4137 629.3349 646.0197 651.9637 664.9698 699.2873 705.7509 709.5570 737.6938 754.8328 776.6500 803.4477 843.1821 847.6950 854.1478 856.2816 861.5747 879.9759 920.1380 929.6456 936.2192 975.3435 980.2045 983.7465 990.0018 991.2610 997.7183 999.5987 1027.1332 1028.9820 1034.3234 1037.9504 1043.7246 1047.3372 1083.6715 1086.1602 1103.9644 1152.4435 1164.6933 1172.9355 1173.7025 1186.7087 1191.5965 1194.0814 1210.0916 1225.7069 1257.4050 1277.1727 1286.8445 1314.8105 1321.3814 1334.0485 1354.9407 1376.0004 1385.2442 1396.2514 1403.0383 1411.4350 1430.6125 1436.0568 1441.9753 1451.6457 1466.9918 1470.8726 1478.1008 1482.6391 1483.5806 1484.3084 1543.8139 1589.1801 1590.8459 1595.0617 1611.9777 1615.0506 1657.4821 2956.2012 2978.5710 2988.9988 3023.9512 3025.9247 3052.4486 3088.6067 3093.0878 3096.9664 3115.9084 3118.9205 3127.3714 3128.6102 3139.8461 3140.5587 3151.0360 3151.4706 3164.3779 3165.2136 3207.0488 3501.5675
redmass: 8.1965 5.7847 3.9767 6.6286 4.1111 4.1241 4.8954 4.2238 5.3957 3.0982 1.4295 1.2641 1.8700 3.0555 3.3822 3.8628 4.1868 3.9081 3.9971 4.1924 3.7273 5.3099 2.3406 2.8018 2.8697 3.6708 3.3475 3.4029 2.8826 3.5426 4.2739 4.6047 6.2256 5.9562 2.7073 3.7791 4.3118 2.3285 3.3895 2.0818 1.8055 2.9412 1.6491 2.5907 1.4837 3.3439 5.4696 1.7352 2.1353 1.2663 2.5014 1.9730 1.3967 1.5895 1.6754 1.3891 1.4054 5.8100 5.7675 1.3270 1.3095 2.3377 2.1804 1.9488 1.4962 1.8454 1.5006 1.6237 1.6578 2.4838 1.4248 2.9786 1.0533 1.0547 2.0351 1.1287 1.1192 2.3405 2.2202 1.4937 1.3997 2.0160 2.0205 1.4234 1.3195 4.8700 6.1586 6.7740 2.5914 1.2664 1.2353 2.9975 2.2415 2.1879 1.0882 1.1324 1.0552 1.2365 1.4724 1.4331 2.2000 4.9636 6.0487 6.0068 6.1661 5.9547 5.9950 8.2429 1.0403 1.0383 1.0814 1.0972 1.0601 1.0976 1.0946 1.0980 1.1013 1.0871 1.0864 1.0869 1.0867 1.0920 1.0919 1.0952 1.0954 1.1012 1.1013 1.0982 1.0638
irintensity: 0.8793 0.2061 0.0603 2.1042 0.5489 0.0497 0.0389 0.1849 0.7463 1.2042 0.6101 0.3925 1.6117 1.0032 1.5776 0.2142 0.3845 0.1531 1.3994 5.1472 2.9429 1.7812 3.8106 0.9265 0.1526 2.9599 0.2169 38.7936 4.5106 32.0544 6.6784 21.8741 0.6433 3.5679 36.6546 20.4117 13.4227 83.4122 9.9824 27.8085 55.7358 61.5818 41.4039 9.8570 29.5682 7.1978 24.0325 6.9986 6.7054 0.3048 9.6788 25.6868 0.6700 3.2353 1.2257 0.3600 0.1239 0.3622 0.8022 0.1041 0.2776 6.6894 11.3595 8.2782 28.8098 151.5316 10.5634 4.5673 4.0851 31.1989 58.6959 0.7660 0.0947 0.0230 13.5010 3.0167 3.0224 3.2508 10.4083 6.8749 4.5955 11.6694 32.2262 14.9098 4.4733 132.9034 2.9636 0.7270 11.0167 21.9336 3.8909 21.0003 14.1265 9.8099 23.7359 3.4951 11.7327 3.8015 9.1755 17.5095 26.5969 10.1584 3.9321 3.2767 0.4115 11.7216 2.9422 194.1775 53.2384 32.1478 6.9624 20.5451 20.7906 13.3435 20.1680 18.3917 3.9111 8.0462 4.3706 0.2564 1.5736 20.3549 16.7205 21.3448 26.6518 29.8574 20.7143 3.9530 16.8590
temp: 298.150 k
press: 1.00000 atm
elementType: 8 8 7 6 6 6 6 6 6 6 6 6 6 6 6 6 6 6 6 6 6 6 6 6 1 1 1 1 1 1 1 1 1 1 1 1 1 1 1 1 1 1 1 1 1
symmnumber: 1
zpe: 956252.8 jmol-1
zpe.correction: 0.364217 hartree
zpe.thermalcorrener: 0.386466 hartree
zpe.thermalcorrenthalpy: 0.387410 hartree
zpe.thermalcorrgfe: 0.310012 hartree
zpe.sumelectzpe: -1016.333934 hartree
zpe.sumelectthermal: -1016.311686 hartree
zpe.sumelectthermalent: -1016.310742 hartree
zpe.sumelectthermalfe: -1016.388139 hartree
dipole: -2.0188 0.2274 1.2806
dipole: 2.4015
quadrupole: -132.4315 -128.7631 -141.4195
quadrupole: 2.7228 3.5606 -1.1063
quadrupole: 1.7732 5.4416 -7.2148 2.7228 3.5606 -1.1063
hfenergy: -1016.6981515 hartree
pointgroup: C01 [X(C21H21N1O2)]
dipole: -0.7908693 0.0648558 0.5128521 debye
polarizability: 252.7480175|10.3396539|235.783816|13.2701817|-14.8698972|201.3459721 unknown
InChI: InChI=1S/C21H21NO2/c1-15-13-19(14-20(23)24)16(2)22(15)21(17-9-5-3-6-10-17)18-11-7-4-8-12-18/h3-13,21,23H,14H2,1-2H3
charge 0 multiplicity 1
45 atoms
O  5.328681 0.980174 -0.643589
O  3.917504 0.336721 -2.370481
N  0.400346 -0.090625 0.910762
C  -1.070988 0.054403 0.79805
C  1.285512 -0.633683 -0.047906
C  1.138214 0.420594 2.001408
C  2.586318 -0.478966 0.462242
C  -1.747567 -1.270382 0.379993
C  -1.493613 1.294172 -0.008675
C  2.489299 0.183652 1.737018
C  0.853728 -1.243598 -1.354398
C  3.871374 -0.90758 -0.222615
C  0.49847 1.083976 3.189631
C  -1.531668 -2.412605 1.193792
C  -2.833929 1.751263 0.095483
C  -2.583301 -1.389738 -0.754307
C  -0.584329 2.02616 -0.808763
C  -2.13294 -3.64881 0.877805
C  -3.260791 2.903892 -0.597349
C  -3.188753 -2.627315 -1.073365
C  -1.011281 3.180173 -1.50651
C  4.340562 0.155057 -1.206261
C  -2.967015 -3.761036 -0.260417
C  -2.349078 3.622554 -1.406854
H  -1.413367 0.234798 1.836309
H  3.319454 0.457535 2.387085
H  1.736957 -1.379623 -1.999697
H  0.357203 -2.222777 -1.221938
H  0.150642 -0.595125 -1.908028
H  3.722888 -1.84116 -0.792753
H  4.662517 -1.075533 0.525548
H  -0.164764 0.403867 3.761621
H  1.289954 1.420084 3.879895
H  -0.097402 1.975258 2.911757
H  -0.871916 -2.332563 2.066621
H  -3.54603 1.200715 0.723384
H  -2.756962 -0.520128 -1.396411
H  0.460773 1.706375 -0.875687
H  -1.952883 -4.522065 1.514834
H  -4.298432 3.243357 -0.502999
H  -3.828888 -2.704611 -1.959436
H  -0.294355 3.733824 -2.122971
H  -3.435556 -4.719825 -0.509091
H  -2.676851 4.51884 -1.94519
H  5.567161 1.692904 -1.297653
