program: Gaussian 09
title: 000213707
version: EM64L-G09RevD.01
frameworkgroup: C1[X(C11H16N2O)]
method: RPBEPBE
basis: SDD
operation: Freq
keyword: #p
keyword: freq=noraman
keyword: PBEPBE/SDD
title: #p freq=noraman PBEPBE/SDD
converged: YES YES NO NO
title: Mulliken charges:
elementType: O N N C C C C C C C C C C C H H H H H H H H H H H H H H H H
charge: -0.317993 -0.275261 -0.650676 -0.060423 0.303192 -0.683276 -0.683669 -0.323707 -0.323780 0.235927 0.444199 -0.387500 -0.384441 -0.804279 0.262412 0.223916 0.215731 0.219581 0.223194 0.216066 0.219727 0.251278 0.250933 0.234207 0.234138 0.228287 0.237706 0.228079 0.332252 0.334180
chargesum: 0.00000
title: Mulliken charges with hydrogens summed into heavy atoms:
elementType: O N N C C C C C C C C C C C
charge: -0.317993 -0.275261 0.015755 0.201989 0.303192 -0.024048 -0.024681 -0.072429 -0.072846 0.235927 0.444199 -0.153293 -0.150303 -0.110208
polarizability: 1.78404863e+02 -1.38816700e+00 1.09069807e+02 -6.78028926e-02 2.97122911e-01 1.17547931e+02
1716.lowfreq: -23.5991 -14.0467 -8.5653 -3.7238 0.0004 0.0007 0.0008 22.1488 32.6852
frequency: -22.9521 22.0334 31.5235 62.3839 80.6275 106.0999 173.4470 181.7874 217.0320 247.7440 268.3280 304.1494 349.4608 352.7540 369.6412 412.2120 440.9699 448.0856 478.6541 486.5816 516.5277 564.8262 584.2496 638.3932 644.5977 709.2439 729.1767 790.9591 828.0114 849.8291 874.2754 919.2749 935.9466 938.2211 955.6763 977.0201 985.4921 1011.1507 1033.3817 1046.9893 1085.8099 1112.3830 1123.3656 1141.5999 1182.9187 1187.5097 1220.0820 1255.7932 1297.6875 1338.2768 1355.5276 1359.5650 1374.4368 1391.1069 1397.2373 1401.0435 1401.3055 1462.8538 1467.9672 1469.9420 1473.6507 1475.6692 1484.7439 1503.7060 1571.8032 1573.9880 1615.0754 1630.1189 2976.6040 2977.5423 2980.8230 3029.1924 3058.1553 3071.7971 3081.7828 3082.7519 3087.3676 3087.8649 3122.4605 3124.5474 3153.0982 3157.9892 3545.2651 3704.5236
redmass: 1.0619 2.7592 3.8426 3.9002 5.0360 3.4112 3.6092 4.0571 1.0417 1.0613 3.2098 2.9139 4.1224 2.6824 3.9392 2.8083 1.2205 2.8026 2.2094 2.6306 1.4260 3.6523 3.2696 6.9031 3.6209 10.3405 3.1571 4.5272 1.5117 1.2410 2.5612 1.3045 2.9317 1.3201 1.3084 1.3709 1.4038 2.7434 2.5746 1.5661 2.1977 1.2910 2.0550 2.4528 1.1384 2.1888 2.6933 3.4495 1.3107 1.3231 5.3754 1.9015 1.2308 1.2357 1.2402 3.0457 2.8548 1.0459 1.0517 1.0946 1.0544 1.0541 1.0531 2.7645 1.5702 6.1237 5.6862 3.2354 1.0388 1.0350 1.0360 1.0854 1.0948 1.0997 1.0978 1.1008 1.0999 1.0999 1.0889 1.0888 1.0953 1.0966 1.0449 1.1041
irintensity: 0.3059 0.0764 0.3736 0.0347 4.7611 4.3595 0.1589 7.7905 0.0010 0.5653 0.0894 1.0308 2.2706 0.2772 7.3941 4.1550 181.4196 10.1391 43.5569 6.7233 16.5799 16.3495 25.9700 0.0871 0.9067 24.0662 10.5846 0.7969 27.0556 0.5708 3.8736 2.0962 1.9151 0.4966 0.2487 0.3989 0.0134 8.3551 4.1683 16.2281 3.8934 15.4092 67.1197 12.4761 1.7436 35.5483 2.9063 37.3099 0.1378 0.8202 1.4718 139.1869 25.8776 35.7685 14.2252 45.6175 197.0618 3.8558 0.2444 11.6040 11.3029 25.2513 15.8577 80.7959 267.1635 2.4948 32.5458 281.0530 32.6622 24.0085 20.5012 8.5039 20.9945 0.7233 87.3466 19.6183 16.8533 33.4219 11.4145 20.9168 17.3032 0.5525 26.6037 50.3633
temp: 298.150 k
press: 1.00000 atm
elementType: 8 7 7 6 6 6 6 6 6 6 6 6 6 6 1 1 1 1 1 1 1 1 1 1 1 1 1 1 1 1
symmnumber: 1
zpe: 658925.2 jmol-1
zpe.correction: 0.250971 hartree
zpe.thermalcorrener: 0.265318 hartree
zpe.thermalcorrenthalpy: 0.266262 hartree
zpe.thermalcorrgfe: 0.208603 hartree
zpe.sumelectzpe: -612.467135 hartree
zpe.sumelectthermal: -612.452789 hartree
zpe.sumelectthermalent: -612.451845 hartree
zpe.sumelectthermalfe: -612.509503 hartree
dipole: 5.1681 -0.4454 -0.0025
dipole: 5.1873
quadrupole: -91.9336 -80.0540 -80.2097
quadrupole: 7.9353 -0.0470 0.0546
quadrupole: -7.8678 4.0117 3.8561 7.9353 -0.0470 0.0546
hfenergy: -612.7181066 hartree
pointgroup: C01 [X(C11H16N2O1)]
dipole: -2.0384745 -0.0978817 0.0070183 debye
polarizability: 178.4097841|-1.2480161|109.0561192|-0.1764815|-0.1244619|117.5566975 unknown
InChI: InChI=1S/C11H16N2O/c1-8(2)13(11(12)14)10-6-4-9(3)5-7-10/h4-8H,12H2,1-3H3
charge 0 multiplicity 1
30 atoms
O  3.330167 1.260482 -0.021521
N  1.315531 0.040534 0.007127
N  1.310773 2.412575 -0.032671
C  2.064854 -1.255523 0.023187
C  -0.129079 0.044136 0.006626
C  1.793691 -2.0866 -1.25088
C  1.777102 -2.06556 1.306833
C  -0.850882 0.036984 -1.214574
C  -0.851749 0.058239 1.22731
C  2.058038 1.237152 -0.016281
C  -2.994013 0.047921 0.005598
C  -2.262918 0.036498 -1.210957
C  -2.263641 0.057164 1.222751
C  -4.512553 0.07623 0.005321
H  3.124135 -0.940174 0.027047
H  2.043859 -1.507137 -2.157233
H  2.41827 -2.998637 -1.243083
H  0.735506 -2.401356 -1.312377
H  2.01168 -1.470351 2.207133
H  2.405026 -2.975133 1.323265
H  0.719308 -2.383325 1.358107
H  -0.295707 0.031998 -2.15871
H  -0.297152 0.070367 2.171696
H  -2.805282 0.026455 -2.164277
H  -2.806645 0.063543 2.175768
H  -4.927571 -0.429337 0.894831
H  -4.890412 1.117189 0.013819
H  -4.927116 -0.415119 -0.892205
H  0.293533 2.423494 -0.02841
H  1.834045 3.283392 -0.048734
