program: Gaussian 09
title: 000015437
version: EM64L-G09RevD.01
frameworkgroup: C1[X(C7H14N2O3S)]
method: RPBEPBE
basis: SDD
operation: Freq
keyword: #p
keyword: freq=noraman
keyword: PBEPBE/SDD
title: #p freq=noraman PBEPBE/SDD
converged: YES YES NO NO
title: Mulliken charges:
elementType: S O O O N N C C C C C C C H H H H H H H H H H H H H H
charge: 0.609047 -0.617915 -0.310333 -0.256797 0.016185 -0.367461 0.022924 -0.703956 -0.714432 -0.208588 -0.829165 0.300472 -0.600572 0.220183 0.268893 0.228509 0.267933 0.224669 0.259463 0.262313 0.314199 0.260472 0.285266 0.330635 0.232021 0.271445 0.234590
chargesum: 0.00000
title: Mulliken charges with hydrogens summed into heavy atoms:
elementType: S O O O N N C C C C C C C
charge: 0.609047 -0.617915 -0.310333 -0.256797 0.016185 -0.036826 0.022924 0.013629 0.037633 0.053725 0.030772 0.300472 0.137484
polarizability: 2.02436330e+02 7.83882058e+00 1.26926616e+02 -1.25388529e+00 2.06391636e+00 8.85924053e+01
1716.lowfreq: -17.4577 -8.3112 -3.5942 -0.0022 0.0005 0.0020 6.6591 39.4888 54.8922
frequency: 5.2976 39.4647 54.8718 70.9924 88.0638 97.7835 139.4777 154.5859 170.5817 192.8918 206.5592 215.0016 225.7393 230.0948 246.2293 287.5242 292.2496 298.0094 312.7588 344.8704 426.0479 446.0556 464.3730 563.6863 576.7654 587.3673 652.5050 699.7658 798.3385 813.8275 862.3044 879.5860 934.8230 949.7508 954.1344 970.5152 993.8020 1026.8267 1046.8259 1086.3407 1124.6833 1145.6680 1191.6608 1209.7380 1282.7534 1314.6747 1330.0284 1380.6338 1396.2150 1428.5108 1430.6873 1438.4042 1456.7973 1457.0490 1469.8571 1482.6809 1483.2201 1488.9440 1510.3652 1530.4189 1714.4725 2956.8849 2971.4778 2983.7715 3005.6375 3044.7496 3063.4514 3064.7803 3066.2899 3079.8216 3109.0718 3115.8927 3141.1989 3156.9547 3573.7277
redmass: 5.7003 4.6037 4.3740 4.3199 1.1263 4.4860 1.1397 3.0908 3.7515 4.5145 2.6187 3.6960 2.5264 3.0625 1.3486 3.0839 2.8852 2.2686 2.6845 3.6774 3.8713 3.8345 3.1568 6.7419 1.1239 5.7179 7.1059 9.0042 14.0065 3.9216 9.2921 3.8460 1.4381 1.2183 1.3890 1.2903 1.3262 1.6341 5.8358 1.5920 1.2845 1.6182 2.3816 2.7874 1.9287 1.1456 2.6073 1.2090 1.1922 1.0539 1.1567 1.0524 1.2365 1.1164 1.0587 1.0635 1.0446 1.0838 1.3534 5.7485 9.8790 1.0410 1.0355 1.0352 1.0269 1.0949 1.1027 1.0907 1.0985 1.1000 1.0977 1.0987 1.1055 1.1058 1.0773
irintensity: 1.0654 2.8152 6.6168 8.1415 0.5289 11.2657 0.3705 5.4808 1.7529 10.1649 7.2410 1.2338 1.3494 0.5399 0.3658 1.9888 16.9699 12.9248 4.9290 2.2972 1.3549 0.5223 1.6965 10.1335 138.0634 7.4062 5.0777 39.5552 75.3610 6.1552 274.9205 60.8297 27.7835 17.4050 0.9185 4.8094 7.3014 20.1106 321.1041 36.7987 0.9177 45.1375 201.8614 15.1267 10.0965 8.0392 9.4064 37.5776 35.6244 12.5848 27.3495 18.2687 119.5228 74.8937 6.5139 22.7292 15.9166 18.6642 157.0412 34.2588 252.4514 13.4483 23.2651 82.2199 5.8105 4.9373 33.6123 8.4400 10.2629 18.4691 9.6118 3.9599 2.2805 2.6376 47.2338
temp: 298.150 k
press: 1.00000 atm
elementType: 16 8 8 8 7 7 6 6 6 6 6 6 6 1 1 1 1 1 1 1 1 1 1 1 1 1 1
symmnumber: 1
zpe: 550329.2 jmol-1
zpe.correction: 0.209609 hartree
zpe.thermalcorrener: 0.226837 hartree
zpe.thermalcorrenthalpy: 0.227781 hartree
zpe.thermalcorrgfe: 0.162286 hartree
zpe.sumelectzpe: -1007.223019 hartree
zpe.sumelectthermal: -1007.205791 hartree
zpe.sumelectthermalent: -1007.204847 hartree
zpe.sumelectthermalfe: -1007.270343 hartree
dipole: -5.1912 -3.3683 -1.4569
dipole: 6.3574
quadrupole: -83.9689 -81.9738 -84.8031
quadrupole: -1.8948 3.9230 0.1027
quadrupole: -0.3870 1.6081 -1.2211 -1.8948 3.9230 0.1027
hfenergy: -1007.4326283 hartree
pointgroup: C01 [X(C7H14N2O3S1)]
dipole: -2.0754058 1.1280511 0.8223045 debye
polarizability: 202.9079341|-4.25774|124.8294208|-3.112682|7.9079338|90.2179962 unknown
InChI: InChI=1S/C6H11N2O2.CH3OS/c1-5(2)4-8-10-6(9)7-3;1-3-2/h4,7H,1-3H3;1H3
charge 0 multiplicity 1
27 atoms
S  2.646935 -1.015038 0.643984
O  4.139553 -1.010904 -0.113821
O  -1.731153 0.628218 0.574495
O  -2.368916 -1.440676 -0.432616
N  -0.464912 0.511853 -0.187549
N  -3.93179 0.079754 0.463881
C  1.911175 0.931721 0.033151
C  2.893814 1.837489 0.778461
C  2.124957 0.916761 -1.474934
C  0.525454 0.96293 0.556467
C  1.560708 -2.107616 -0.493154
C  -2.678893 -0.364438 0.118692
C  -5.127609 -0.747506 0.274564
H  2.769714 1.783791 1.875398
H  3.929123 1.540381 0.527314
H  2.753735 2.889191 0.463851
H  3.116388 0.466739 -1.68955
H  2.134233 1.954013 -1.860084
H  1.334386 0.362497 -2.004231
H  0.36112 1.308675 1.590001
H  0.514982 -1.76221 -0.467585
H  1.654026 -3.134842 -0.109749
H  2.002171 -2.021121 -1.496382
H  -4.008852 1.014957 0.864559
H  -5.630576 -0.952533 1.237366
H  -4.812919 -1.703456 -0.172799
H  -5.845356 -0.258531 -0.40913
