program: Gaussian 09
title: 000206039
version: EM64L-G09RevD.01
frameworkgroup: C1[X(C3H9N2O3PS)]
method: RPBEPBE
basis: SDD
operation: Freq
keyword: #p
keyword: freq=noraman
keyword: PBEPBE/SDD
title: #p freq=noraman PBEPBE/SDD
converged: YES YES NO NO
title: Mulliken charges:
elementType: S P O O O N N C C C H H H H H H H H H
charge: 0.044032 1.058246 -0.658735 -0.719596 -0.569243 -0.659241 -0.338959 -0.403646 -0.697754 0.118849 0.301307 0.327816 0.224473 0.265513 0.389640 0.305375 0.404194 0.404073 0.203655
chargesum: 0.00000
title: Mulliken charges with hydrogens summed into heavy atoms:
elementType: S P O O O N N C C C
charge: 0.044032 1.058246 -0.254541 -0.315523 -0.569243 0.035774 -0.135304 0.086340 -0.068630 0.118849
polarizability: 1.34497801e+02 9.69099956e+00 1.00436448e+02 1.05929058e+01 -1.52043764e+00 6.92429387e+01
1716.lowfreq: -13.0510 -9.9901 -4.4135 -0.0019 -0.0015 -0.0008 35.1608 76.2008 79.9493
frequency: 34.4701 76.1717 79.8878 101.7027 133.4662 156.1468 197.5922 218.5054 228.9647 277.8903 284.6483 312.9197 332.8435 399.3569 413.8290 438.3759 470.1248 499.4476 569.6239 635.4418 667.8690 677.9532 731.7581 778.0034 839.0268 898.9269 969.6543 1006.9265 1011.9605 1030.5456 1076.4322 1087.7830 1091.8716 1154.6683 1235.9037 1263.2492 1312.9063 1376.8522 1448.7348 1462.3464 1633.1744 1644.7640 3024.4011 3044.8425 3106.9828 3126.9018 3301.7925 3410.6637 3572.9668 3583.2314 3628.3452
redmass: 6.3951 3.9642 4.3784 7.5817 4.4041 2.8368 3.0507 2.5336 2.8787 8.6027 4.5571 4.6472 4.6090 1.7641 2.1347 3.6984 1.1332 2.5657 5.3319 6.9881 3.0815 3.6117 1.4904 1.7487 1.3792 2.7679 1.6355 1.1994 1.7105 4.0417 2.7422 1.3188 1.5717 1.1781 1.1125 1.1829 1.2897 3.2343 1.0798 1.0861 3.4849 1.3015 1.0644 1.0586 1.1017 1.1043 1.0756 1.0558 1.0660 1.0660 1.0955
irintensity: 3.9587 1.5393 4.4890 6.0318 14.7883 20.0589 31.2054 10.2724 28.8394 2.9566 19.0690 39.2479 43.3941 66.5014 0.6857 192.0303 95.9965 11.5172 8.7034 104.2927 27.4937 49.8290 362.1348 9.6689 44.8515 13.3963 8.0639 53.9771 68.1276 2.2778 150.9648 10.6371 98.8567 2.0008 8.6291 8.2835 13.4600 81.5441 7.9411 22.3390 141.8740 148.5204 12.7666 5.4533 5.5507 1.5818 30.5058 195.7574 57.7394 71.9297 44.7970
temp: 298.150 k
press: 1.00000 atm
elementType: 16 15 8 8 8 7 7 6 6 6 1 1 1 1 1 1 1 1 1
symmnumber: 1
zpe: 359255.6 jmol-1
zpe.correction: 0.136833 hartree
zpe.thermalcorrener: 0.149947 hartree
zpe.thermalcorrenthalpy: 0.150891 hartree
zpe.thermalcorrgfe: 0.096836 hartree
zpe.sumelectzpe: -1193.356032 hartree
zpe.sumelectthermal: -1193.342919 hartree
zpe.sumelectthermalent: -1193.341975 hartree
zpe.sumelectthermalfe: -1193.396030 hartree
dipole: 0.5455 -4.0650 0.0599
dipole: 4.1019
quadrupole: -100.1136 -65.3020 -71.9981
quadrupole: -3.8164 0.2140 -1.9041
quadrupole: -20.9757 13.8359 7.1398 -3.8164 0.2140 -1.9041
hfenergy: -1193.4928657 hartree
pointgroup: C01 [X(C3H9N2O3P1S1)]
dipole: 0.1413356 -1.5762283 0.3161359 debye
dipolederiv: -0.5703206 -0.0561342 0.052721 -0.1541262 -0.2588007 -0.0393196 0.0080435 -0.0102722 -0.1582158 1.7172935 -0.0097565 -0.1025808 0.3724503 1.8040469 0.0464029 -0.3262843 -0.1467841 1.6024918 -0.6665436 0.0832207 -0.016221 -0.0096707 -0.4911572 0.1915655 0.1646006 0.2153841 -1.0474983 -0.83634 0.214732 0.2216098 0.0869094 -1.070983 -0.1894298 0.2139768 -0.108339 -0.522983 -0.8016186 -0.0315702 -0.0179472 -0.1733472 -0.6240521 -0.0169562 -0.0079696 0.0143389 -0.5632654 -0.7932919 -0.2002283 0.1075706 -0.43345 -0.8467588 -0.054491 0.2277614 -0.0078214 -0.5474292 -1.0842432 -0.2263914 0.0308757 -0.1976086 -0.2696741 -0.1402815 -0.0160013 -0.164337 -0.4132543 -0.1363721 0.1291038 -0.0238569 0.1735577 -0.0242184 0.0360336 -0.077614 -0.0002942 0.0352828 0.5437379 -0.1132111 -0.0245091 -0.2241742 0.0212011 0.0549072 0.0195608 0.0692631 0.0374337 1.1930656 0.3500239 0.0828565 0.4570484 0.7750793 -0.1962927 0.1545363 -0.2327442 0.0998879 -0.0341485 -0.0534994 -0.0222679 0.0585832 0.0026223 -0.0573691 -0.0115151 -0.0442863 0.0949712 0.0174922 0.0198108 0.0060199 0.0107599 0.0779447 0.0707493 0.0097674 0.037755 0.0151172 0.0155939 -0.0193179 -0.116743 -0.0432013 0.0129923 -0.0791545 -0.0754274 -0.0446608 0.0106894 0.0290225 -0.0388712 0.0679491 -0.0440951 0.006183 0.0654656 0.0441431 0.0399613 0.0555795 0.462563 -0.1086373 -0.0144653 -0.0807025 0.2313656 0.0599746 0.0101735 0.0529674 0.2964757 0.1086689 0.0216522 -0.0681272 0.016176 0.1833281 0.0900442 -0.0761189 0.1015984 0.289186 0.3678451 -0.066532 -0.0581579 -0.0848497 0.1659042 -0.0017884 -0.0148703 0.0359849 0.3439183 0.2526374 0.0392536 -0.0572419 0.0495229 0.3623792 -0.0215263 -0.0977754 0.0248566 0.2033028 0.2149584 0.0663524 -0.0474844 0.2202174 -0.0574025 0.1814662 -0.1489872 0.1674295 0.1683097 unknown
polarizability: 135.7659133|9.5528645|97.7775075|7.3428978|-7.6253824|70.6337673 unknown
InChI: InChI=1S/C3H9N2O3PS/c4-3(5)1-2-10-9(6,7)8/h4,6-7H,1-2,5H2
charge 0 multiplicity 1
19 atoms
S  -1.110542 1.818509 -0.370089
P  -2.156356 -0.125585 0.085089
O  -1.777889 -0.277113 1.759334
O  -1.117641 -1.448851 -0.459425
O  -3.657106 -0.290723 -0.399998
N  1.778196 -1.547807 0.288825
N  3.706121 -0.062777 0.099927
C  1.524182 0.652855 -0.746802
C  0.627257 1.357649 0.299744
C  2.438983 -0.373322 -0.079644
H  1.041869 2.328274 0.617697
H  0.455605 0.745568 1.198753
H  0.896468 0.141913 -1.498091
H  2.158712 1.383981 -1.268924
H  0.781808 -1.673492 0.072994
H  2.273435 -2.282646 0.790777
H  -1.999407 -1.154976 2.165599
H  -1.398731 -1.835282 -1.328808
H  4.253136 -0.817575 0.568345
