program: Gaussian 09
title: 000206038
version: EM64L-G09RevD.01
frameworkgroup: C1[X(C12H20N4)]
method: RPBEPBE
basis: SDD
operation: Freq
keyword: #pfreq=noraman
keyword: PBEPBE/SDD
title: #p freq=noraman PBEPBE/SDD
converged: NO YES NO NO
title: Mulliken charges:
elementType: N N N N C C C C C C C C C C C C H H H H H H H H H H H H H H H H H H H H
charge: -0.080354 -0.080393 -0.005173 -0.005154 0.222812 0.222649 -0.410951 -0.410934 -0.354339 -0.354211 -0.722114 -0.722177 -0.691597 -0.691606 -0.211341 -0.211276 0.209493 0.239201 0.239011 0.209485 0.202345 0.229928 0.229881 0.202454 0.252985 0.235223 0.232877 0.253196 0.232840 0.235206 0.213488 0.224537 0.213002 0.213028 0.224553 0.213430
chargesum: 0.00000
title: Mulliken charges with hydrogens summed into heavy atoms:
elementType: N N N N C C C C C C C C C C C C
charge: -0.080354 -0.080393 -0.005173 -0.005154 0.222812 0.222649 0.037742 0.037561 0.077934 0.078124 -0.001030 -0.000935 -0.040571 -0.040594 -0.211341 -0.211276
polarizability: 1.70029936e+02 1.28197179e+01 1.55040325e+02 -6.41385601e+00 -6.99891439e+00 1.30378219e+02
1716.lowfreq: -31.0942 -10.8309 -8.6810 -0.0006 0.0003 0.0004 3.0667 7.6784 42.9876
frequency: -30.6597 -8.5687 42.9861 66.1490 76.8349 84.9072 85.9644 104.4813 116.6817 143.6374 161.5271 196.1469 197.9774 221.7325 227.4758 233.5778 234.0930 249.3038 255.6218 265.4326 334.4322 355.8232 363.3563 387.9903 411.4254 443.3672 463.9993 566.6330 590.7824 593.3077 616.4218 698.3197 730.5882 734.0736 782.2832 816.8716 828.1113 871.7257 874.6506 896.5367 901.2259 950.5788 958.5454 1023.7771 1024.3325 1055.8059 1056.2001 1069.5964 1075.1374 1115.9662 1128.9960 1131.5450 1141.9087 1193.0928 1199.7663 1252.3717 1253.3591 1288.8871 1289.9694 1302.8868 1305.8975 1350.9805 1351.9698 1377.4949 1378.8300 1394.5588 1394.6104 1442.9887 1445.8810 1457.6942 1464.4608 1465.5172 1472.8958 1473.4155 1475.3231 1475.5689 1478.9703 1479.0756 1485.8444 1485.8714 2197.5994 2197.8678 2976.4714 2976.5457 2981.5797 2981.6492 2991.3067 2991.3542 2998.4553 2998.6260 3026.1929 3026.3328 3055.1413 3055.4239 3074.6480 3074.7331 3079.2365 3079.2611 3103.1143 3103.3194 3112.2371 3112.5187
redmass: 7.7833 4.0874 3.6707 3.5380 2.2283 1.7154 4.0203 3.9379 5.5045 5.6874 2.7260 2.8692 2.9769 1.5130 1.7918 1.1386 1.4203 1.3019 1.5919 2.2719 4.0433 2.9099 2.9558 4.4622 6.1854 4.4075 5.6600 5.2809 7.7187 4.8667 5.4404 5.0808 1.2621 1.1685 2.0803 2.0398 4.8290 1.6543 1.5502 1.7897 1.6094 1.8788 1.8209 2.0093 1.9986 2.0057 1.9828 2.3784 2.1938 2.7592 2.5845 2.0392 2.5716 2.3399 2.2298 1.4130 1.4163 1.2894 1.2783 1.1746 1.2229 1.4599 1.4612 1.2173 1.2028 1.2099 1.2096 1.4273 1.0750 2.5906 1.0537 1.1351 1.0546 1.0574 1.0561 1.0505 1.0435 1.0433 1.0782 1.0783 12.6437 12.6412 1.0360 1.0360 1.0602 1.0602 1.0586 1.0586 1.0344 1.0344 1.1001 1.1001 1.1032 1.1032 1.1015 1.1015 1.0992 1.0991 1.1007 1.1007 1.1018 1.1016
irintensity: 0.0008 2.8357 0.5266 0.0017 3.9539 0.0158 7.6118 4.2984 0.0009 0.0001 1.9669 0.0005 0.9996 0.0001 2.8369 0.0754 0.0026 0.0003 1.2887 0.0001 0.7048 0.4546 0.0000 0.0001 0.0001 0.8950 3.6562 0.0002 5.6505 0.0082 4.3265 6.2330 0.0063 24.5283 0.0001 2.8624 0.0000 2.9305 0.0001 0.0004 3.8026 11.1401 0.0001 5.5034 0.0238 0.0079 4.2788 0.0000 1.1191 0.0001 11.6813 0.0005 19.1681 55.7557 0.0001 28.2230 0.0008 4.1735 0.2258 9.9542 0.0011 4.1508 0.1323 0.0107 21.3530 4.2796 19.1573 0.0012 4.4616 0.0002 32.7581 0.0340 9.5005 0.0471 0.2093 23.1220 8.1049 11.0189 4.4983 27.1326 6.8023 0.0142 67.0960 0.8484 1.2350 3.8480 50.4426 20.9187 27.4853 0.1729 4.2790 0.3319 8.0467 0.0833 1.7011 138.0798 4.0440 72.6485 0.2544 39.2186 21.3292 0.4211
temp: 298.150 k
press: 1.00000 atm
elementType: 7 7 7 7 6 6 6 6 6 6 6 6 6 6 6 6 1 1 1 1 1 1 1 1 1 1 1 1 1 1 1 1 1 1 1 1
symmnumber: 1
zpe: 787086.8 jmol-1
zpe.correction: 0.299786 hartree
zpe.thermalcorrener: 0.318148 hartree
zpe.thermalcorrenthalpy: 0.319093 hartree
zpe.thermalcorrgfe: 0.253961 hartree
zpe.sumelectzpe: -686.948982 hartree
zpe.sumelectthermal: -686.930619 hartree
zpe.sumelectthermalent: -686.929675 hartree
zpe.sumelectthermalfe: -686.994806 hartree
dipole: 0.0188 -0.0215 -0.0118
dipole: 0.0309
quadrupole: -101.6664 -112.8910 -100.4704
quadrupole: -17.6253 14.1626 15.5788
quadrupole: 3.3429 -7.8817 4.5388 -17.6253 14.1626 15.5788
hfenergy: -687.2487672 hartree
pointgroup: C01 [X(C12H20N4)]
dipole: -0.0063627 -0.0090256 0.0050963 debye
polarizability: 173.6229286|-10.9362622|152.5839816|-5.0876203|4.1200077|129.2415688 unknown
InChI: InChI=1S/C12H20N4/c1-5-7-11(3,9-13)15-16-12(4,10-14)8-6-2/h5-8H2,1-4H3
charge 0 multiplicity 1
36 atoms
N  0.385182 -0.386533 -0.320555
N  -0.401177 0.394755 0.316769
N  3.107416 -2.397822 -0.967482
N  -3.11164 2.424418 0.954596
C  1.635626 -0.734027 0.521306
C  -1.651369 0.742686 -0.525279
C  2.440383 0.563941 0.850642
C  -2.46032 -0.554068 -0.849198
C  3.006988 1.313742 -0.374424
C  -3.029108 -1.297136 0.378956
C  1.194738 -1.461596 1.821247
C  -1.209324 1.464106 -1.82824
C  3.771802 2.587455 0.043378
C  -3.797988 -2.570102 -0.033627
C  2.438325 -1.653514 -0.319956
C  -2.450699 1.66759 0.313239
H  3.268966 0.286392 1.530744
H  1.74926 1.218789 1.415819
H  -1.771371 -1.213363 -1.41184
H  -3.288161 -0.276656 -1.530261
H  2.183215 1.584299 -1.064024
H  3.681701 0.643669 -0.941745
H  -3.70164 -0.622674 0.943657
H  -2.206111 -1.567528 1.06954
H  0.584257 -0.769496 2.424904
H  0.598257 -2.360994 1.590169
H  2.080265 -1.771151 2.401072
H  -0.601463 0.767933 -2.429863
H  -2.094393 1.774207 -2.408469
H  -0.609919 2.362534 -1.60098
H  3.114019 3.28916 0.589759
H  4.17184 3.117899 -0.839351
H  4.625046 2.342187 0.703327
H  -4.650646 -2.324787 -0.694315
H  -4.199429 -3.09582 0.85129
H  -3.142532 -3.275997 -0.577404
