program: Gaussian 09
title: 000206034
version: EM64L-G09RevD.01
frameworkgroup: C1[X(C10H22O)]
method: RPBEPBE
basis: SDD
operation: Freq
keyword: #pfreq=noraman
keyword: PBEPBE/SDD
title: #p freq=noraman PBEPBE/SDD
converged: YES YES NO NO
title: Mulliken charges:
elementType: O C C C C C C C C C C H H H H H H H H H H H H H H H H H H H H H H
charge: -0.296655 0.388288 -0.450002 -0.409483 -0.386503 -0.031328 -0.751111 -0.747488 -0.716151 -0.716887 -0.531627 0.202684 0.194778 0.220166 0.228388 0.190074 0.186946 0.195137 0.231660 0.216062 0.211313 0.196312 0.224184 0.241298 0.216924 0.209569 0.209167 0.210589 0.209996 0.214632 0.230230 0.202063 0.206778
chargesum: 0.00000
title: Mulliken charges with hydrogens summed into heavy atoms:
elementType: O C C C C C C C C C C
charge: -0.296655 0.388288 -0.052540 0.039071 -0.009483 0.163809 -0.092076 -0.085695 -0.080491 -0.081671 0.107443
polarizability: 1.25302735e+02 7.61058492e-01 1.11753095e+02 -2.23532784e+00 -1.38616888e-01 9.91546106e+01
1716.lowfreq: -21.1161 -9.2259 -0.0006 -0.0006 -0.0003 15.0928 21.4911 40.3365 78.8220
frequency: 20.0331 39.7524 78.7540 89.4080 111.7984 120.8772 187.2331 203.2943 206.1061 215.1621 245.1812 259.0025 264.0148 295.7017 326.3151 353.0508 356.0065 370.3054 407.2369 483.6855 506.7607 553.4499 695.2508 736.6854 781.7752 808.8161 843.5725 909.1220 915.7252 922.0668 952.8169 956.7743 977.6568 997.3775 1008.1459 1020.5014 1062.7100 1074.8776 1110.8848 1118.6748 1150.1656 1170.2496 1189.3778 1192.0274 1209.8738 1242.4593 1258.8217 1283.7019 1298.5213 1315.6688 1334.4420 1346.0560 1359.8557 1367.0442 1373.5843 1384.2564 1393.5980 1430.2886 1444.0789 1456.6111 1459.4307 1464.4293 1465.4748 1470.0309 1475.2378 1476.9406 1478.2552 1484.6635 1487.8611 1490.7109 1491.2676 2936.3625 2939.4697 2959.4409 2961.7373 2968.9046 2973.4134 2978.5573 2989.7330 2992.0046 2993.5636 3006.0723 3012.8866 3053.2677 3063.2547 3065.5874 3067.1592 3072.3527 3072.4494 3083.2767 3088.8291 3090.9509 3100.2934
redmass: 2.7502 2.9099 2.3524 2.5395 2.0033 1.6656 1.1236 1.4442 1.1865 1.7315 1.1517 1.4851 1.6799 2.8145 2.3989 2.3537 2.0171 2.2649 2.4183 2.6584 2.9749 2.4584 3.8923 1.1535 2.9310 1.6547 2.0456 1.3956 1.4177 1.5345 1.3881 1.9653 1.6217 1.8608 1.7775 4.1488 1.8070 1.7075 1.2740 1.7553 1.5393 2.1327 1.8857 1.9169 1.8298 1.9216 1.5556 1.2458 1.3634 1.5613 1.4531 1.4059 1.4844 1.2556 1.2170 1.2285 1.2166 1.1265 1.0603 1.0725 1.0631 1.0490 1.0516 1.0633 1.0552 1.0542 1.0674 1.0552 1.0614 1.0548 1.0660 1.0341 1.0638 1.0682 1.0662 1.0349 1.0388 1.0357 1.0609 1.0378 1.0954 1.0988 1.1010 1.1032 1.0999 1.0998 1.0989 1.0987 1.0987 1.1002 1.0978 1.0993 1.0992
irintensity: 0.1111 0.1063 4.4830 0.0919 0.4628 1.8755 0.3246 0.1860 2.4541 0.4447 0.0629 1.1015 3.2303 3.8133 4.7686 0.5397 0.0589 0.1445 1.4766 1.4707 5.0773 4.5975 8.5347 5.4521 2.2841 1.9102 2.5372 1.2373 1.3958 1.4663 0.2313 1.1313 3.4113 5.2683 5.4190 54.6425 3.4482 3.9523 0.0360 5.7181 3.7813 33.1803 7.7971 2.8544 24.2018 53.4073 11.2925 2.4286 6.8139 0.8418 2.8026 4.0293 1.4683 31.3909 22.9055 22.5467 18.0738 3.0482 0.1020 1.3657 9.8046 2.6386 5.2386 1.9968 2.6001 1.3076 7.7455 23.8988 2.1142 26.2978 10.0233 56.6131 16.5874 9.4257 85.4379 46.0599 9.3058 26.6471 31.9214 14.2460 31.5228 15.2441 81.3698 55.3966 34.9430 0.9876 71.8110 72.0115 78.9789 4.6767 20.6205 67.8335 31.6832
temp: 298.150 k
press: 1.00000 atm
elementType: 8 6 6 6 6 6 6 6 6 6 6 1 1 1 1 1 1 1 1 1 1 1 1 1 1 1 1 1 1 1 1 1 1
symmnumber: 1
zpe: 786551.3 jmol-1
zpe.correction: 0.299582 hartree
zpe.thermalcorrener: 0.314800 hartree
zpe.thermalcorrenthalpy: 0.315744 hartree
zpe.thermalcorrgfe: 0.257012 hartree
zpe.sumelectzpe: -468.525649 hartree
zpe.sumelectthermal: -468.510431 hartree
zpe.sumelectthermalent: -468.509487 hartree
zpe.sumelectthermalfe: -468.568219 hartree
dipole: 0.0911 -0.0068 1.6179
dipole: 1.6205
quadrupole: -72.1356 -68.9288 -74.4495
quadrupole: -0.1315 -3.0086 1.1275
quadrupole: -0.2977 2.9092 -2.6115 -0.1315 -3.0086 1.1275
hfenergy: -468.825231 hartree
pointgroup: C01 [X(C10H22O1)]
dipole: -0.0434743 0.0140026 -0.6359228 debye
polarizability: 125.2445176|-0.7004791|111.7376201|-2.5670308|0.4769795|99.2283034 unknown
InChI: InChI=1S/C10H22O/c1-9(2)7-6-8-10(3,4)11-5/h9H,6-8H2,1-5H3
charge 0 multiplicity 1
33 atoms
O  2.105387 0.810439 0.860201
C  2.034048 -0.419689 0.009962
C  0.743825 -0.421365 -0.859272
C  -0.579062 -0.268909 -0.076538
C  -1.788907 -0.089448 -1.023727
C  -3.172498 0.089175 -0.333679
C  3.288292 -0.526621 -0.889431
C  2.031494 -1.548654 1.058685
C  -3.240524 1.381532 0.516704
C  -3.573371 -1.14697 0.508605
C  2.159893 2.089358 0.15631
H  0.726628 -1.36499 -1.442515
H  0.815628 0.394588 -1.6089
H  -0.735953 -1.15934 0.561886
H  -0.488774 0.596765 0.606971
H  -1.843915 -0.966922 -1.703056
H  -1.60353 0.793255 -1.672788
H  -3.919247 0.190125 -1.150687
H  4.202345 -0.402671 -0.281607
H  3.326608 -1.518983 -1.37485
H  3.290784 0.236239 -1.689434
H  1.88321 -2.531678 0.576076
H  2.992301 -1.560782 1.602215
H  1.22853 -1.388712 1.797053
H  -2.557463 1.327314 1.384525
H  -4.262833 1.543259 0.906965
H  -2.960015 2.269617 -0.080958
H  -3.51492 -2.076451 -0.088997
H  -4.609046 -1.048259 0.884299
H  -2.911363 -1.264741 1.386499
H  2.212279 2.854449 0.948339
H  1.255369 2.274543 -0.460067
H  3.057596 2.181427 -0.488885
