program: Gaussian 09
title: 000206017
version: EM64L-G09RevD.01
frameworkgroup: C1[X(C15H19ClN2O)]
method: RPBEPBE
basis: SDD
operation: Freq
keyword: #p
keyword: freq=noraman
keyword: PBEPBE/SDD
title: #p freq=noraman PBEPBE/SDD
converged: YES YES NO NO
title: Mulliken charges:
elementType: Cl O N N C C C C C C C C C C C C C C C H H H H H H H H H H H H H H H H H H H
charge: -0.075157 -0.455124 -0.105446 -0.093777 0.326887 -0.305140 0.097953 0.168940 -0.458787 0.409521 0.444233 -0.665754 -0.887637 -0.869545 -0.832425 -0.815290 -0.224429 -0.203487 -0.324541 0.254076 0.241553 0.270149 0.266766 0.228269 0.246677 0.236915 0.221448 0.292720 0.236696 0.256241 0.232590 0.230043 0.240975 0.252482 0.363926 0.284327 0.257956 0.255198
chargesum: 0.00000
title: Mulliken charges with hydrogens summed into heavy atoms:
elementType: Cl O N N C C C C C C C C C C C C C C C
charge: -0.075157 -0.091198 -0.105446 -0.093777 0.326887 -0.051064 0.097953 0.168940 0.052914 0.409521 0.444233 -0.665754 -0.145924 -0.118462 -0.106899 -0.091790 0.059898 0.054468 -0.069343
polarizability: 2.58691988e+02 -1.67952404e+00 1.97562785e+02 -1.48473487e+01 -3.92206385e+00 1.09677561e+02
1716.lowfreq: -13.1210 -4.5917 -0.0007 0.0012 0.0014 4.7297 27.3688 28.3420 41.2796
frequency: 27.2898 28.2640 41.2604 64.7279 70.6168 79.0154 98.2479 113.6989 143.7891 159.2125 186.8207 199.1267 217.1790 230.9153 264.2662 278.0108 279.6497 311.3479 328.9017 346.9542 350.7672 378.8934 393.2519 409.0259 431.6196 439.7908 480.3083 501.0162 578.1787 589.1936 617.8297 627.6149 650.8660 655.2664 706.5273 737.5577 758.1643 776.0402 786.6441 831.4715 842.7702 853.1779 879.5076 929.4977 998.6682 1005.5260 1007.7150 1009.2234 1021.4933 1028.3712 1028.7076 1042.3181 1049.7042 1054.5624 1056.0950 1071.5818 1094.9405 1107.5742 1175.0358 1199.8110 1216.1812 1233.5588 1261.5160 1290.7244 1311.0539 1330.0969 1339.9076 1346.5095 1363.7190 1380.7753 1391.8005 1393.6527 1397.5689 1402.4785 1409.7283 1431.0463 1434.0589 1451.2848 1457.6712 1466.1518 1470.6106 1476.1239 1477.2662 1482.4636 1492.7322 1505.6545 1512.6663 1555.8690 1592.9136 2967.6370 2976.0542 2980.3464 2984.2859 3026.0876 3027.9427 3045.8804 3047.4048 3057.4275 3057.8768 3101.9715 3119.7332 3120.0968 3123.4945 3125.1640 3224.2268 3226.8487 3252.2173 3523.4175
redmass: 4.5719 4.9402 3.9025 2.4433 1.8194 2.7416 2.0443 2.8689 1.9013 1.6079 2.0232 1.2322 3.5750 1.7404 5.4474 5.6094 6.1650 3.2838 1.1632 2.5039 3.0487 2.4804 2.6178 5.3586 5.5345 4.8877 2.7726 4.6537 3.3384 3.3690 4.6960 3.2735 4.2556 3.6735 3.9673 1.2725 2.7836 1.5933 3.7640 3.7192 1.4183 2.7053 6.2165 2.5933 2.4807 2.7592 2.3007 1.4921 1.4224 1.9152 1.8732 2.8490 1.6545 1.6614 1.6984 1.9492 2.0474 1.8236 1.5869 2.4728 1.7096 1.5778 1.9585 1.7095 2.8851 5.0888 5.0441 1.6752 1.6952 2.6300 1.2468 1.3095 1.5285 1.2485 1.4079 2.9558 2.0342 1.1700 1.7617 1.1535 1.1555 1.0552 2.1631 1.0577 1.1043 1.0464 1.0615 5.0465 7.0690 1.0446 1.0429 1.0423 1.0406 1.0796 1.0661 1.0970 1.0919 1.0976 1.0942 1.1017 1.0944 1.0952 1.0927 1.0958 1.0913 1.0971 1.1095 1.0662
irintensity: 1.8870 1.3025 0.1679 5.8301 0.3467 0.6275 1.5808 2.1089 0.3016 0.7734 8.2083 0.1562 1.0338 4.6651 1.0510 1.4378 3.1390 16.2391 173.7773 3.9083 0.3786 4.6398 0.7487 2.4773 9.9322 0.3473 10.1713 0.3985 2.3350 0.1276 5.0299 7.6553 14.3492 24.2316 1.1966 6.9595 9.8258 61.2326 8.5657 11.0047 3.9808 5.5390 10.7300 88.3757 43.7829 11.7154 22.4743 3.2747 0.5682 28.5461 19.1681 1.5402 0.7402 28.5763 5.9439 14.4761 1.1200 21.0987 4.9001 33.4042 34.4018 18.9938 33.3813 11.2760 5.3575 0.3534 3.3564 3.3310 9.2960 3.2925 0.6821 2.1417 11.3315 48.9341 5.1163 19.2351 38.0445 2.1592 15.8072 7.3759 14.4906 28.3142 14.9421 13.9650 47.0052 0.4093 12.1974 27.7639 0.6670 35.8275 30.6439 23.9657 23.9573 13.2100 27.7359 16.6230 29.6007 11.6736 16.6708 8.3480 8.8520 18.9843 4.7597 1.0677 4.2605 1.3316 1.5759 5.4541
temp: 298.150 k
press: 1.00000 atm
elementType: 17 8 7 7 6 6 6 6 6 6 6 6 6 6 6 6 6 6 6 1 1 1 1 1 1 1 1 1 1 1 1 1 1 1 1 1 1 1
symmnumber: 1
zpe: 810407.2 jmol-1
zpe.correction: 0.308668 hartree
zpe.thermalcorrener: 0.328627 hartree
zpe.thermalcorrenthalpy: 0.329571 hartree
zpe.thermalcorrgfe: 0.258911 hartree
zpe.sumelectzpe: -1226.354292 hartree
zpe.sumelectthermal: -1226.334332 hartree
zpe.sumelectthermalent: -1226.333388 hartree
zpe.sumelectthermalfe: -1226.404049 hartree
dipole: 1.3175 -0.4457 -0.3732
dipole: 1.4400
quadrupole: -153.2707 -109.7069 -124.0533
quadrupole: 10.5788 -4.3872 1.3464
quadrupole: -24.2604 19.3034 4.9570 10.5788 -4.3872 1.3464
hfenergy: -1226.6629597 hartree
pointgroup: C01 [X(C15H19Cl1N2O1)]
dipole: 0.5160066 -0.1615384 -0.1691396 debye
polarizability: 257.8703668|-0.2005722|197.7159958|-18.6108326|0.7997668|110.3459711 unknown
InChI: InChI=1S/C15H19ClN2O/c1-9-11(3)15(16)12(4)10(2)14(9)13(19)7-18-6-5-17-8-18/h5-6,8,13,19H,7H2,1-4H3
charge 0 multiplicity 1
38 atoms
Cl 5.166488 0.026714 -0.586248
O  -1.291238 -0.814155 1.642306
N  -3.141442 -0.041681 -0.549779
N  -5.198687 0.906774 -0.360416
C  0.612214 0.058983 0.331848
C  -0.897145 0.121541 0.567564
C  1.344304 1.287698 0.33899
C  1.268826 -1.176287 0.052154
C  -1.687967 -0.16432 -0.747785
C  2.743943 1.295894 0.054452
C  2.668143 -1.188188 -0.238987
C  3.352719 0.048148 -0.226671
C  0.646868 2.608365 0.658008
C  0.54016 -2.514557 0.056327
C  3.536212 2.593328 0.058082
C  3.364326 -2.501233 -0.544162
C  -3.994194 -1.027641 -0.023027
C  -3.9163 1.105469 -0.727333
C  -5.252674 -0.42643 0.079228
H  -1.179716 1.141104 0.88509
H  -1.375399 0.561088 -1.520326
H  -1.459037 -1.176021 -1.118664
H  1.355097 3.447685 0.686016
H  -0.124563 2.865819 -0.093424
H  0.148441 2.574201 1.644835
H  1.123325 -3.272322 0.609542
H  0.413925 -2.906917 -0.973109
H  -0.440406 -2.439257 0.544365
H  3.522012 3.069781 1.056108
H  4.587693 2.421059 -0.211022
H  3.120905 3.321007 -0.663273
H  2.784101 -3.101422 -1.26712
H  3.47294 -3.114976 0.371369
H  4.370285 -2.341536 -0.957791
H  -2.233745 -0.624891 1.892123
H  -3.649076 -2.038637 0.177374
H  -3.51128 2.031187 -1.131066
H  -6.183562 -0.864678 0.431419
