program: Gaussian 09
title: 000206009
version: EM64L-G09RevD.01
frameworkgroup: C1[X(C12H14N2S)]
method: RPBEPBE
basis: SDD
operation: Freq
keyword: #p
keyword: freq=noraman
keyword: PBEPBE/SDD
title: #p freq=noraman PBEPBE/SDD
converged: YES YES NO NO
title: Mulliken charges:
elementType: S N N C C C C C C C C C C C C H H H H H H H H H H H H H H
charge: 0.157034 -0.383936 -0.096621 0.143382 -0.756591 0.228889 -0.803045 0.487712 -0.781135 -0.251391 -0.384999 -0.373823 -0.221700 -0.221694 -0.238882 0.250617 0.284689 0.262612 0.252356 0.304537 0.234300 0.267041 0.233621 0.258440 0.231962 0.238441 0.224581 0.225832 0.227769
chargesum: 0.00000
title: Mulliken charges with hydrogens summed into heavy atoms:
elementType: S N N C C C C C C C C C C C C
charge: 0.157034 -0.079399 -0.096621 0.143382 -0.221285 0.228889 -0.288078 0.487712 -0.046172 0.007049 -0.153037 -0.135381 0.002882 0.004138 -0.011113
polarizability: 2.35895302e+02 7.71892090e+00 1.49491172e+02 -6.43372494e+00 3.91528440e+00 1.03739190e+02
1716.lowfreq: -5.7841 -0.0021 -0.0012 0.0009 4.2585 7.8555 17.6012 23.4092 38.7970
frequency: 16.9205 22.7839 38.7477 40.9771 65.7910 77.8894 111.7234 143.8809 218.2994 233.0354 247.2131 325.6252 326.4885 389.0486 402.4507 474.8537 551.0233 617.3483 618.8180 628.8250 638.4720 653.5743 663.3832 700.4689 724.3241 744.4717 771.7018 777.4625 810.7160 849.7513 871.7280 903.4407 917.3274 922.7626 968.2749 974.6922 989.6122 993.7922 1026.8105 1044.6328 1058.9366 1070.9220 1097.9179 1123.0144 1172.0851 1183.2016 1186.9099 1211.8581 1223.6593 1237.8750 1258.8083 1290.1561 1324.7644 1333.5473 1385.4262 1399.9723 1406.2866 1437.5056 1439.8812 1453.1977 1461.5258 1472.7232 1479.9010 1484.2535 1590.4865 1593.6759 1613.8187 2970.5079 3007.3199 3011.6053 3045.0382 3078.3602 3093.0396 3096.6913 3120.0806 3123.5136 3135.7932 3146.9566 3163.8015 3237.5902 3579.9941
redmass: 4.9789 3.7398 4.5292 3.7161 5.0072 1.0833 5.6933 6.5730 4.1898 2.6647 3.7852 2.6447 4.7355 2.6747 2.7950 3.7994 5.4408 6.2699 4.3848 3.4542 4.9841 1.3878 3.3987 1.6631 4.6810 4.5192 1.4463 2.3427 3.8971 1.2505 1.5602 1.5835 5.8718 1.4744 1.6746 1.3924 5.3434 1.3657 2.1896 1.4465 1.5846 1.5066 1.6351 1.1083 1.0516 1.7769 1.1128 1.1898 2.6582 1.8469 1.6035 2.4804 1.2784 2.4272 8.6669 4.3364 1.3108 1.3544 2.2060 1.4725 1.1252 1.1143 1.3043 2.3680 5.9620 6.0983 6.1629 1.0386 1.0572 1.0596 1.0982 1.1084 1.0971 1.1042 1.0850 1.0876 1.0921 1.0965 1.1017 1.0985 1.0818
irintensity: 1.2599 1.4562 1.0523 1.2105 3.3179 0.0372 4.8359 0.4396 2.4707 0.9597 4.1551 2.6426 6.5763 8.8172 0.0032 6.2350 1.5857 0.1978 8.3962 60.4592 7.8585 70.8684 9.5927 60.1125 18.6564 20.7107 18.2780 24.5724 3.2993 0.0620 0.4408 0.3893 2.4980 2.9896 0.4162 0.0459 0.0669 0.1093 8.1605 4.1399 10.6179 13.5707 9.4952 1.9746 0.0427 6.3123 1.0858 24.8416 6.6664 13.3525 8.8319 7.3781 0.2493 15.1170 0.0642 6.7561 8.8399 36.2394 7.5402 2.6355 5.8949 11.5904 0.9002 17.8701 11.4312 0.7549 5.4468 45.1621 53.3711 7.0343 20.2000 14.1434 7.6863 3.5362 5.8205 0.9776 16.9948 43.5901 24.5842 2.7662 37.4369
temp: 298.150 k
press: 1.00000 atm
elementType: 16 7 7 6 6 6 6 6 6 6 6 6 6 6 6 1 1 1 1 1 1 1 1 1 1 1 1 1 1
symmnumber: 1
zpe: 611900.3 jmol-1
zpe.correction: 0.233061 hartree
zpe.thermalcorrener: 0.247952 hartree
zpe.thermalcorrenthalpy: 0.248896 hartree
zpe.thermalcorrgfe: 0.186920 hartree
zpe.sumelectzpe: -972.147284 hartree
zpe.sumelectthermal: -972.132393 hartree
zpe.sumelectthermalent: -972.131449 hartree
zpe.sumelectthermalfe: -972.193425 hartree
dipole: -1.8442 3.3201 0.1869
dipole: 3.8025
quadrupole: -72.0377 -92.8255 -95.3484
quadrupole: -12.4099 5.4604 0.4111
quadrupole: 14.6995 -6.0883 -8.6112 -12.4099 5.4604 0.4111
hfenergy: -972.3803448 hartree
pointgroup: C01 [X(C12H14N2S1)]
dipole: 0.7507753 -1.284395 -0.157247 debye
polarizability: 235.469189|7.9587121|149.6473944|8.9279021|4.7203864|104.0090815 unknown
InChI: InChI=1S/C12H14N2S/c1-10-12(14-9-13-10)8-15-7-11-5-3-2-4-6-11/h2-6,9,13H,7-8H2,1H3
charge 0 multiplicity 1
29 atoms
S  0.178722 0.192566 -0.0491
N  4.766026 -0.207949 -0.685796
N  3.739903 1.492241 0.385156
C  2.945031 0.328377 0.472265
C  1.635481 0.342209 1.191356
C  3.565081 -0.742764 -0.192263
C  -1.24842 0.198215 1.230571
C  -2.5733 0.032623 0.526156
C  3.145457 -2.168324 -0.404364
C  4.829498 1.133561 -0.315231
C  -3.132252 -1.25672 0.328654
C  -3.27724 1.163532 0.036255
C  -4.368177 -1.413216 -0.337525
C  -4.512733 1.010228 -0.630943
C  -5.062942 -0.279303 -0.819457
H  1.533459 -0.500034 1.898249
H  1.527884 1.297241 1.729396
H  -1.18969 1.158677 1.770488
H  -1.055623 -0.629383 1.935256
H  5.462252 -0.719559 -1.227249
H  3.75946 -2.878908 0.182246
H  2.09314 -2.288711 -0.098943
H  3.210325 -2.463926 -1.468598
H  5.662174 1.784585 -0.570339
H  -2.593587 -2.138248 0.697148
H  -2.850174 2.163902 0.175852
H  -4.788698 -2.415227 -0.479741
H  -5.045299 1.893103 -1.002145
H  -6.02216 -0.398987 -1.335655
