program: Gaussian 09
title: 000213711
version: EM64L-G09RevD.01
frameworkgroup: C1[X(C22H19NO)]
method: RPBEPBE
basis: SDD
operation: Freq
keyword: #p
keyword: freq=noraman
keyword: PBEPBE/SDD
title: #p freq=noraman PBEPBE/SDD
converged: YES YES NO NO
title: Mulliken charges:
elementType: O N C C C C C C C C C C C C C C C C C C C C C C H H H H H H H H H H H H H H H H H H H
charge: -0.290135 -0.397875 -0.469676 0.370789 0.426101 -0.552957 -0.620141 0.278539 0.349214 -0.396523 -0.436954 -0.383561 -0.436281 -0.261482 -0.247828 -0.250804 -0.237360 0.156851 0.268546 -0.352283 -0.363453 -0.224314 -0.235738 -0.227429 0.267737 0.242828 0.219679 0.195960 0.221488 0.307462 0.264149 0.244827 0.230330 0.234796 0.230037 0.230290 0.228536 0.228058 0.272999 0.223342 0.231693 0.228834 0.231709
chargesum: 0.00000
title: Mulliken charges with hydrogens summed into heavy atoms:
elementType: O N C C C C C C C C C C C C C C C C C C C C C C
charge: -0.290135 -0.090413 -0.201938 0.370789 0.426101 -0.090450 -0.202693 0.278539 0.349214 -0.132374 -0.192127 -0.153231 -0.201485 -0.031445 -0.017538 -0.022268 -0.009302 0.156851 0.268546 -0.079284 -0.140111 0.007379 -0.006905 0.004280
polarizability: 2.58760352e+02 -1.33504430e+01 2.49124323e+02 1.61091752e+01 -1.69371042e+01 2.11738056e+02
1716.lowfreq: -7.9426 -0.0009 -0.0006 -0.0001 1.5385 6.9050 11.4298 23.8669 32.9087
frequency: 8.7288 23.7582 32.7906 43.7882 56.2363 90.1154 116.1587 132.8264 162.1797 180.7106 198.0087 248.1428 275.0222 283.8079 307.0269 325.8195 350.1391 380.1731 403.9100 421.4277 431.8554 460.5069 475.1958 494.1863 511.4050 538.0631 548.0242 581.4063 587.3804 614.5954 624.5208 639.7293 661.1031 686.2538 702.6962 708.4103 732.7757 743.9010 763.2714 769.5711 773.9740 792.5320 810.5410 856.2172 862.7258 881.8964 883.2574 892.6848 923.7290 935.0651 950.8227 957.0951 969.0782 983.9821 989.2572 990.4240 992.0276 1003.7348 1006.1106 1027.9591 1036.3734 1047.6762 1057.5536 1082.8174 1103.2000 1106.8210 1123.5667 1157.3153 1167.6804 1173.3054 1175.5927 1181.0917 1189.9538 1197.1990 1215.4525 1225.8628 1231.1640 1248.1872 1256.5295 1293.5639 1316.8190 1319.1841 1330.8390 1349.3922 1366.7517 1381.9489 1384.5067 1401.1063 1428.7255 1432.5998 1443.3647 1451.5490 1452.4117 1477.2894 1486.8004 1489.7009 1495.0808 1566.9021 1587.4875 1595.0249 1601.7714 1609.6272 1611.0265 1612.5641 2963.5768 2970.3697 3021.5267 3031.4324 3036.3620 3110.4968 3116.0613 3118.6411 3122.5230 3125.3265 3131.2588 3138.4970 3140.5051 3144.1926 3157.6554 3160.5012 3161.9360 3169.2249 3560.7869
redmass: 5.1225 5.5596 4.2673 5.2059 5.0480 3.8511 4.5774 4.0810 3.6037 4.0193 5.2887 3.4817 4.3476 5.1052 4.8304 3.9422 3.0501 5.3459 2.8343 4.2777 2.5610 2.9748 4.2348 4.0707 1.3786 4.1494 3.5406 2.8232 3.6721 6.3648 6.0944 6.2115 6.3357 5.0783 1.6995 3.5381 2.7312 3.1838 2.0889 1.6310 1.6608 2.3487 5.1688 1.2499 2.0581 1.6436 1.4407 4.6243 2.7824 1.4505 1.5218 1.5116 2.0045 1.4370 4.0451 1.4311 1.3661 1.8274 2.6886 2.3274 2.8935 2.3355 2.4977 1.5791 2.0937 2.0732 2.8409 1.2282 1.8820 1.0582 1.0768 1.3013 1.1234 1.9967 2.1339 1.3442 1.7455 1.6697 1.5146 1.4387 1.3298 1.6263 1.4362 2.6882 1.4003 5.1256 9.0893 2.3230 2.0938 2.2215 2.1627 1.5814 1.2176 1.3628 2.0192 2.5063 2.0360 6.5277 6.4782 6.5664 6.6181 6.0535 6.0722 6.3002 1.0649 1.0616 1.0985 1.0837 1.0952 1.0872 1.0871 1.0869 1.0888 1.0886 1.0872 1.0930 1.0934 1.0923 1.0958 1.1007 1.1006 1.1005 1.0772
irintensity: 4.3179 0.2919 0.3336 3.0682 2.7989 0.2289 0.6627 2.3509 1.3582 1.1553 1.3666 2.6842 0.0979 12.5460 5.3227 0.0837 0.4070 1.7000 0.2324 6.0273 5.8401 0.5446 5.0577 0.6444 75.7507 4.7925 10.1517 34.5914 32.2260 1.2143 18.9077 7.7321 3.6338 8.3133 62.4886 25.5901 15.0314 10.9566 12.9228 52.3201 50.9809 22.0521 1.5077 1.6944 22.5879 12.5497 0.5796 1.1423 0.7426 2.8353 2.2189 3.7191 2.7129 1.7581 1.3831 0.0322 0.3743 5.2458 1.3360 20.0602 5.6501 1.9100 1.4591 20.8186 12.1895 0.2924 13.8188 5.3358 8.1395 1.0788 0.2681 2.3028 11.7034 1.1135 9.7441 5.3913 13.6161 18.4837 17.0653 37.0863 0.2386 12.1735 134.1379 4.7927 1.2199 4.1747 1.5035 2.0543 19.4910 11.0041 3.7203 257.2993 23.7448 19.3427 72.0652 21.2018 44.2320 100.1178 1.8233 0.9218 38.8439 1.3431 3.7107 3.5520 16.2146 50.6038 36.3674 10.1381 47.8645 11.0536 9.0312 9.5418 1.4973 2.3842 2.0574 18.8674 24.8737 23.3953 17.0379 39.0486 28.8338 22.4747 13.8528
temp: 298.150 k
press: 1.00000 atm
elementType: 8 7 6 6 6 6 6 6 6 6 6 6 6 6 6 6 6 6 6 6 6 6 6 6 1 1 1 1 1 1 1 1 1 1 1 1 1 1 1 1 1 1 1
symmnumber: 1
zpe: 913007.8 jmol-1
zpe.correction: 0.347746 hartree
zpe.thermalcorrener: 0.367115 hartree
zpe.thermalcorrenthalpy: 0.368059 hartree
zpe.thermalcorrgfe: 0.296984 hartree
zpe.sumelectzpe: -978.080171 hartree
zpe.sumelectthermal: -978.060802 hartree
zpe.sumelectthermalent: -978.059858 hartree
zpe.sumelectthermalfe: -978.130933 hartree
dipole: 0.6526 -0.8245 3.9014
dipole: 4.0406
quadrupole: -127.4696 -131.6093 -136.0831
quadrupole: -2.1252 -1.6006 -2.7231
quadrupole: 4.2511 0.1114 -4.3624 -2.1252 -1.6006 -2.7231
hfenergy: -978.4279171 hartree
pointgroup: C01 [X(C22H19N1O1)]
dipole: 0.1754388 0.0852184 -1.5776914 debye
polarizability: 255.1884791|10.5895146|244.4435799|-17.8535596|-24.1926528|219.990671 unknown
InChI: InChI=1S/C22H19NO/c24-22(18-10-2-1-3-11-18)23-21-19-12-6-4-8-16(19)14-15-17-9-5-7-13-20(17)21/h1-13,21,23H,14-15H2
charge 0 multiplicity 1
43 atoms
O  -1.596782 -0.30283 2.231809
N  -0.606114 -0.065881 0.137317
C  0.773388 0.075388 0.684922
C  1.59234 -1.210318 0.444577
C  1.369473 1.423394 0.271827
C  2.835243 -0.502388 -1.769249
C  1.810222 0.605955 -2.112753
C  2.479004 -1.474324 -0.642237
C  1.785623 1.702302 -1.060427
C  1.390353 -2.223778 1.425273
C  1.433496 2.450099 1.245306
C  3.12564 -2.741526 -0.692049
C  2.246501 3.002141 -1.381419
C  2.0390 -3.470809 1.359381
C  1.900942 3.742367 0.918683
C  2.922105 -3.732265 0.287046
C  2.30565 4.02217 -0.405009
C  -1.708464 -0.213958 0.964954
C  -3.050559 -0.280828 0.280568
C  -4.113292 -0.907907 0.979305
C  -3.297042 0.280034 -1.000272
C  -5.394621 -0.99869 0.397574
C  -4.58222 0.194043 -1.579694
C  -5.631819 -0.451877 -0.886161
H  0.596831 0.122061 1.774214
H  3.798101 -0.008069 -1.524289
H  3.0226 -1.10122 -2.681607
H  0.81311 0.14232 -2.258559
H  2.085795 1.048301 -3.088017
H  -0.724266 -0.126725 -0.874228
H  0.697882 -2.016979 2.250424
H  1.103932 2.234958 2.268821
H  3.806423 -2.9467 -1.528313
H  2.567475 3.214312 -2.408879
H  1.860443 -4.225603 2.13284
H  1.943778 4.521142 1.687816
H  3.439935 -4.695036 0.212906
H  2.664816 5.021601 -0.67471
H  -3.909305 -1.306683 1.978317
H  -2.508397 0.824973 -1.533557
H  -6.207913 -1.490544 0.942328
H  -4.7676 0.639416 -2.563372
H  -6.628104 -0.518336 -1.337406
