program: Gaussian 09
title: 000205995
version: EM64L-G09RevD.01
frameworkgroup: C1[X(C17H24N2O3S)]
method: RPBEPBE
basis: SDD
operation: Freq
keyword: #p
keyword: freq=noraman
keyword: PBEPBE/SDD
title: #p freq=noraman PBEPBE/SDD
converged: YES YES NO NO
title: Mulliken charges:
elementType: S O O O N N C C C C C C C C C C C C C C C C C H H H H H H H H H H H H H H H H H H H H H H H H
charge: 0.191858 -0.257681 -0.264996 -0.259985 -0.111835 -0.311413 -0.717713 -0.355244 -0.378051 0.698753 -0.386564 0.254845 -0.761511 -0.356077 -0.056066 -0.449588 -0.456441 0.206118 0.162030 -0.684329 -0.703640 -0.323224 -0.202662 0.293618 0.277261 0.231343 0.186517 0.206989 0.202581 0.221649 0.285670 0.287321 0.238159 0.176520 0.174426 0.234388 0.266086 0.235124 0.225057 0.194644 0.222315 0.211723 0.211949 0.205940 0.253791 0.241313 0.239033
chargesum: 0.00000
title: Mulliken charges with hydrogens summed into heavy atoms:
elementType: S O O O N N C C C C C C C C C C C C C C C C C
charge: 0.191858 -0.257681 -0.264996 -0.259985 -0.111835 -0.077025 -0.424095 0.153359 0.015455 0.698753 0.037666 0.254845 -0.188520 0.058602 0.118361 -0.183501 -0.221317 0.206118 0.162030 -0.042313 -0.074028 -0.069432 0.277683
polarizability: 2.78226149e+02 2.44111597e+01 2.02883603e+02 -2.16627354e+01 8.82567328e+00 1.98757866e+02
1716.lowfreq: -24.6509 -19.9166 -6.5236 -0.0014 0.0008 0.0009 1.7933 6.6526 14.0189
frequency: -24.5964 -15.4932 12.6244 21.6508 28.3159 36.4395 51.3495 63.3052 87.5494 97.6579 107.1327 133.4800 154.0145 184.0589 189.6083 208.1566 222.6028 231.1430 236.2059 281.0253 300.1572 320.9343 337.9404 359.3693 385.2386 408.1547 411.7616 426.0921 444.0379 454.1047 455.2748 508.3073 529.2877 572.2546 580.1028 600.1477 620.1570 632.2431 678.2634 705.8976 725.2664 732.7114 758.4354 782.9604 791.5242 809.5067 820.4926 830.0925 840.9294 862.3363 883.2383 904.8513 910.3569 912.1913 918.9937 921.5473 930.7554 949.3501 961.6596 977.7977 992.0989 1034.6694 1057.0565 1064.4269 1065.8390 1092.2184 1115.9356 1119.5478 1121.1201 1131.7512 1136.0342 1153.0224 1162.3177 1170.3708 1181.0915 1183.6858 1221.3386 1227.2054 1240.0164 1247.4777 1255.0361 1265.5818 1282.7774 1302.1210 1316.0940 1333.1696 1335.3389 1339.6415 1350.2578 1365.3302 1367.4028 1379.2590 1387.5572 1393.1534 1417.7619 1442.5262 1443.5977 1446.6804 1459.1151 1459.9670 1463.1845 1467.8884 1473.7333 1475.7381 1478.5835 1484.2703 1487.0625 1489.2815 1605.1893 1613.1599 1628.1030 2851.8882 2894.4107 2935.1655 2967.1018 2974.2542 2975.2479 3004.5243 3013.8501 3018.8086 3020.4009 3024.1562 3040.6208 3041.5938 3060.6514 3066.8713 3072.0276 3072.5162 3083.8839 3097.1906 3111.0164 3133.9854 3170.1451 3183.0389 3444.4610
redmass: 2.2681 2.8976 4.7126 5.0997 4.1517 4.0473 9.0510 4.7865 4.1592 4.8024 3.0804 3.7360 3.2297 3.9392 2.2396 1.2924 3.0056 5.9724 1.1969 3.1658 2.6210 3.5611 4.5659 2.9699 3.8447 2.9918 3.4651 3.5182 2.2524 7.5774 2.8617 2.8185 6.5771 3.9313 5.1809 6.3921 3.0158 1.4068 9.3733 4.7094 5.5418 3.5672 5.3394 5.7446 5.0749 2.2439 1.4489 1.9330 9.6778 2.6996 1.4947 1.6224 1.6529 1.2597 1.7008 2.6078 1.3749 1.5940 1.6281 5.2532 2.9557 2.2988 3.2671 2.0103 1.4666 3.1046 1.6088 1.2228 1.0488 1.4065 2.1544 2.5408 2.1383 1.4694 1.7669 1.6325 1.6010 1.4423 1.9687 2.2509 1.6683 1.2733 1.2597 1.3623 1.6214 1.3756 1.3853 1.4320 1.3249 1.2795 1.2192 1.2886 2.9947 1.2753 2.4911 1.1481 1.1570 4.2262 1.0710 1.1104 1.1218 1.0543 1.0746 2.2231 1.0493 1.0802 1.3339 1.0603 9.0996 7.7588 8.2847 1.0707 1.0709 1.0821 1.0351 1.0365 1.0599 1.0624 1.0548 1.0852 1.0901 1.0920 1.0571 1.0946 1.0996 1.1000 1.0994 1.1036 1.0988 1.1174 1.1067 1.0900 1.0929 1.0953 1.0743
irintensity: 14.3327 0.0762 0.0550 0.0663 0.3026 0.0252 0.1724 0.6797 0.3584 6.5315 2.1101 4.1472 0.5446 2.7330 2.7046 0.8401 3.9897 0.2311 0.6985 1.2286 3.5341 1.0945 4.7420 6.1388 11.8279 3.4974 3.9548 2.7622 0.5706 5.0948 3.6076 4.0558 22.4828 9.8956 1.3499 19.8212 20.6596 66.2414 0.8394 13.0340 5.0584 20.2227 29.6341 0.8883 4.8643 9.9236 24.2907 6.2470 31.1711 4.4469 18.6295 4.4502 6.9403 3.9594 2.8726 11.9167 1.0798 3.9019 2.9478 139.2323 19.9044 7.4519 40.7447 10.7142 4.3127 17.9548 7.0757 9.5740 0.6126 3.3891 12.6470 31.2460 32.3555 11.4243 5.5963 11.2704 2.4604 78.9689 56.3215 141.0496 135.1032 18.7897 9.8245 7.1318 73.3586 2.7553 3.1752 11.7180 7.4858 5.3497 19.0229 21.1713 76.3221 3.6854 24.3225 2.6583 20.6795 76.0173 5.8913 13.1870 11.5660 2.4691 2.7503 105.0835 12.8614 19.7085 29.1466 29.1053 297.8461 28.0128 1.0241 134.8013 120.6821 41.8358 46.3237 37.7198 32.8523 36.6844 123.2680 15.4082 7.4236 14.3603 14.5539 58.6088 38.0239 14.1316 102.0454 2.8395 36.1146 29.5708 2.3461 8.2328 1.1585 4.8160 0.9235
temp: 298.150 k
press: 1.00000 atm
elementType: 16 8 8 8 7 7 6 6 6 6 6 6 6 6 6 6 6 6 6 6 6 6 6 1 1 1 1 1 1 1 1 1 1 1 1 1 1 1 1 1 1 1 1 1 1 1 1
symmnumber: 1
zpe: 1012547.0 jmol-1
zpe.correction: 0.385659 hartree
zpe.thermalcorrener: 0.407880 hartree
zpe.thermalcorrenthalpy: 0.408824 hartree
zpe.thermalcorrgfe: 0.331078 hartree
zpe.sumelectzpe: -1393.663217 hartree
zpe.sumelectthermal: -1393.640996 hartree
zpe.sumelectthermalent: -1393.640052 hartree
zpe.sumelectthermalfe: -1393.717798 hartree
dipole: -1.8418 -0.4469 2.5468
dipole: 3.1746
quadrupole: -139.2305 -144.9040 -139.2423
quadrupole: 8.8835 8.8309 1.6546
quadrupole: 1.8951 -3.7784 1.8833 8.8835 8.8309 1.6546
hfenergy: -1394.0488761 hartree
pointgroup: C01 [X(C17H24N2O3S1)]
dipole: -0.7291315 1.0062497 0.1257743 debye
polarizability: 276.3788396|-23.239642|196.8650216|-25.8450658|-7.4767982|206.6237566 unknown
InChI: InChI=1S/C17H24N2O3S/c1-12(2)9-18-6-3-7-19-16(20)10-23-17(19)13-4-5-14-15(8-13)22-11-21-14/h4-5,8,12,17-18H,3,6-7,9-11H2,1-2H3
charge 0 multiplicity 1
47 atoms
S  -0.974579 -1.130999 -2.97249
O  2.20088 -1.607205 -0.595273
O  -3.798883 -1.296616 2.13348
O  -5.400833 0.449133 1.730967
N  0.456552 -0.0628 -0.916067
N  3.961397 1.495185 0.041418
C  -0.786012 0.257758 -1.630261
C  0.964397 0.904479 0.089391
C  1.633325 2.144823 -0.547014
C  -2.009953 0.350065 -0.739179
C  3.051777 1.820266 -1.075469
C  1.135536 -1.245542 -1.176585
C  0.463995 -2.105588 -2.252432
C  5.016091 0.490207 -0.213882
C  5.746917 0.078656 1.089556
C  -2.218722 -0.608983 0.297143
C  -2.953928 1.380603 -0.964268
C  -3.381512 -0.483178 1.051405
C  -4.325308 0.543562 0.816416
C  4.777089 -0.590058 2.090091
C  6.935913 -0.852022 0.754549
C  -4.139931 1.495074 -0.186915
C  -5.12741 -0.768639 2.54352
H  -0.67159 1.195454 -2.2031
H  1.72327 0.37619 0.694512
H  0.121742 1.197265 0.741938
H  1.004796 2.558136 -1.362181
H  1.707676 2.933758 0.227433
H  3.412886 2.665143 -1.70849
H  2.997235 0.935377 -1.736688
H  0.113623 -3.050452 -1.806334
H  1.196427 -2.328149 -3.04371
H  4.521078 -0.404689 -0.637768
H  5.778993 0.83718 -0.956771
H  6.155763 1.001808 1.559396
H  4.328732 2.33581 0.506403
H  -1.495466 -1.406378 0.488375
H  -2.772093 2.108974 -1.763021
H  3.930047 0.080507 2.316752
H  5.293674 -0.846056 3.034454
H  4.358914 -1.517985 1.656482
H  6.575791 -1.780273 0.270579
H  7.483127 -1.141304 1.670671
H  7.653309 -0.3650 0.066676
H  -4.868859 2.290018 -0.361204
H  -5.089483 -0.487006 3.608647
H  -5.899697 -1.526907 2.323646
