program: Gaussian 09
title: 000205992
version: EM64L-G09RevD.01
frameworkgroup: C1[X(C18H32O4)]
method: RPBEPBE
basis: SDD
operation: Freq
keyword: #pfreq=noraman
keyword: PBEPBE/SDD
title: #p freq=noraman PBEPBE/SDD
converged: YES YES NO NO
title: Mulliken charges:
elementType: O O O O C C C C C C C C C C C C C C C C C C H H H H H H H H H H H H H H H H H H H H H H H H H H H H H H H H
charge: -0.254052 -0.289267 -0.217762 -0.248782 -0.053529 -0.066980 -0.409049 -0.420306 -0.393282 -0.384535 -0.437062 -0.392249 -0.383365 -0.503868 -0.383278 0.197736 -0.372262 -0.353687 -0.356556 0.295685 -0.696810 -0.755259 0.250699 0.272288 0.241573 0.206836 0.230062 0.229535 0.211755 0.210849 0.197361 0.191971 0.215333 0.231977 0.196985 0.192474 0.192450 0.195126 0.256882 0.247444 0.193264 0.190991 0.190092 0.188943 0.186896 0.188184 0.194464 0.195219 0.209198 0.214938 0.209913 0.245622 0.247050 0.252145
chargesum: 0.00000
title: Mulliken charges with hydrogens summed into heavy atoms:
elementType: O O O O C C C C C C C C C C C C C C C C C C
charge: -0.254052 -0.289267 -0.217762 -0.248782 0.197171 0.205307 0.039359 0.039292 0.029322 0.004796 0.010248 -0.002790 0.004211 0.000459 0.000978 0.197736 0.006773 0.021393 0.033128 0.295685 -0.062761 -0.010442
polarizability: 2.43037796e+02 -2.53001756e+00 2.11956892e+02 -1.89500828e+00 7.30900370e+00 1.70091606e+02
1716.lowfreq: -10.0383 -3.7543 -0.0011 -0.0007 0.0003 5.8536 11.8768 25.3775 25.9130
frequency: 10.7709 25.1403 25.7872 31.8870 41.8086 46.2756 48.5007 56.1413 67.4105 70.3623 77.4412 88.1799 100.5507 113.5231 116.3802 131.5325 144.7574 150.6107 164.1536 182.2755 210.5488 228.8964 244.9156 255.7898 273.2556 302.0329 333.0887 373.5745 397.0183 422.4738 437.3670 450.3944 461.5935 486.5398 503.8830 537.2657 562.5909 597.1451 621.4727 638.8997 719.1021 719.8377 723.7050 732.4953 747.2766 777.0611 815.8752 833.5631 855.7202 876.2084 887.7521 892.3294 898.7759 908.8771 930.5439 957.7189 970.1635 991.3416 994.4283 1003.0519 1017.3168 1021.9726 1039.3979 1040.3667 1054.2661 1059.2342 1074.0318 1081.9448 1081.9760 1091.3518 1093.8526 1118.7653 1122.4085 1133.5374 1165.9470 1172.1192 1185.9851 1195.3743 1209.1552 1214.5749 1216.1463 1241.1580 1245.8883 1251.6242 1263.8450 1271.6639 1277.5512 1279.3342 1288.4120 1289.0408 1295.6961 1297.9764 1300.7173 1309.0334 1320.9778 1323.8997 1333.6811 1344.4590 1349.6444 1351.6880 1354.0321 1356.0071 1367.8364 1382.3033 1389.2015 1389.7141 1441.9412 1447.7327 1452.5435 1454.7642 1456.8351 1460.1113 1460.1337 1463.7421 1465.2608 1470.5149 1476.0643 1476.7216 1477.5154 1481.8196 1486.2819 1489.6241 1651.4371 1659.4475 2948.6828 2948.8412 2950.5437 2951.8437 2956.3227 2961.9886 2968.1594 2971.3126 2974.0280 2981.4162 2985.5658 2988.7414 2989.6412 2992.4174 2992.7499 2996.1001 3002.1510 3006.4260 3007.1159 3014.2372 3025.6384 3034.0223 3035.9769 3041.2406 3056.6599 3059.4005 3067.1184 3067.6071 3069.9774 3074.8255 3097.4047 3142.3663
redmass: 5.3939 4.9658 4.8805 5.2966 4.1574 1.6157 1.3452 3.2302 2.4445 1.9041 2.2262 2.9723 4.1437 1.9197 2.5454 3.2117 1.9559 2.0916 5.3748 3.7046 3.5490 1.1267 2.3793 4.6511 3.2030 3.1526 3.4205 3.0544 3.3963 3.8979 3.7929 3.1807 3.3116 2.9711 2.7289 4.2235 3.5230 4.9833 3.8042 2.6991 2.8519 1.1004 1.1051 1.1740 1.2387 1.3397 1.6705 1.6460 1.6894 3.9754 1.9519 2.9197 2.0166 1.5495 2.7017 2.7116 1.3087 3.8726 1.9335 4.2602 2.1455 1.2998 3.1497 1.6650 2.8787 2.3654 2.5799 2.2144 2.0616 1.9235 2.3179 1.5901 2.6444 3.0532 1.8325 1.8333 1.8044 2.5456 1.3599 1.5987 1.5471 1.3323 1.3345 1.2535 1.2859 1.2566 1.3006 1.0200 1.0695 1.1496 1.1319 1.1092 1.3019 1.2809 1.3004 1.4334 1.3937 1.4264 1.4877 1.5647 1.6441 1.6423 1.5700 1.2416 1.2177 1.4834 1.0776 1.0787 1.0619 1.0536 1.0830 1.0733 1.0719 1.0639 1.0759 1.0793 1.0705 1.0521 1.0869 1.0870 1.0930 1.0940 9.4886 11.9971 1.0585 1.0586 1.0591 1.0592 1.0593 1.0589 1.0583 1.0370 1.0592 1.0958 1.0970 1.0625 1.0679 1.0991 1.0629 1.0647 1.1017 1.0803 1.0378 1.1033 1.1036 1.0993 1.0901 1.1036 1.0979 1.1020 1.0999 1.1007 1.0993 1.0977 1.0959 1.1016
irintensity: 0.9275 1.4168 1.6020 2.1129 2.9552 0.2907 0.3587 1.7819 0.1098 0.4926 0.2497 1.0637 1.0210 0.0302 0.0720 0.0232 0.0896 0.0327 2.1910 6.5024 1.7458 0.0096 6.5588 2.1637 1.1022 0.9492 0.6735 2.5774 0.0947 6.4065 3.1815 4.5432 0.5682 0.6202 1.4982 8.2674 7.8186 4.9967 10.8866 2.3771 23.4212 10.2803 0.9118 4.1299 0.4692 1.8843 1.5015 15.4041 5.2224 3.8841 2.4460 32.9430 16.4668 13.0872 67.9010 16.0635 10.9118 4.6579 94.3289 0.9877 209.8219 30.7244 7.9522 10.8976 0.9961 8.1099 1.8105 1.2514 0.0963 19.2540 3.9082 31.5144 12.8742 120.9293 18.2157 43.2064 16.9375 339.0398 5.6143 51.4404 37.8600 0.1101 0.9333 2.6023 5.4727 1.3102 1.9028 0.1022 0.0477 1.0448 1.4576 1.1642 1.2020 0.9776 1.5618 4.2833 0.4549 0.4996 4.7064 1.6513 0.7355 0.2323 2.4848 55.3088 11.4081 1.6386 14.2864 8.7884 21.9082 18.3782 15.9865 0.0920 0.3434 0.2680 0.0608 0.5459 3.7087 9.3194 11.2119 2.6584 3.9678 32.0340 192.4695 284.9363 0.0622 0.0356 0.2458 3.2277 0.7474 76.5054 147.8381 34.4717 38.6125 0.5647 0.5782 50.3598 13.3145 0.7148 22.3581 12.7959 0.3329 17.1308 2.6299 1.6506 0.2425 1.7067 24.2837 177.2973 33.0411 73.4348 30.8115 101.2280 55.7136 18.5947 7.6699 10.5770
temp: 298.150 k
press: 1.00000 atm
elementType: 8 8 8 8 6 6 6 6 6 6 6 6 6 6 6 6 6 6 6 6 6 6 1 1 1 1 1 1 1 1 1 1 1 1 1 1 1 1 1 1 1 1 1 1 1 1 1 1 1 1 1 1 1 1
symmnumber: 1
zpe: 1236138.3 jmol-1
zpe.correction: 0.470820 hartree
zpe.thermalcorrener: 0.497527 hartree
zpe.thermalcorrenthalpy: 0.498471 hartree
zpe.thermalcorrgfe: 0.408013 hartree
zpe.sumelectzpe: -1004.249933 hartree
zpe.sumelectthermal: -1004.223226 hartree
zpe.sumelectthermalent: -1004.222282 hartree
zpe.sumelectthermalfe: -1004.312740 hartree
dipole: -0.5002 3.0878 3.8973
dipole: 4.9974
quadrupole: -132.2334 -145.3325 -136.6303
quadrupole: -0.7134 -18.3529 -4.0637
quadrupole: 5.8320 -7.2671 1.4351 -0.7134 -18.3529 -4.0637
hfenergy: -1004.7207529 hartree
pointgroup: C01 [X(C18H32O4)]
dipole: 0.1340421 1.2201181 -1.5358933 debye
polarizability: 242.7513092|3.6867093|212.1918911|-2.2819515|-7.4568302|170.1430939 unknown
InChI: InChI=1S/C18H32O4/c1-3-4-5-6-7-8-9-10-12-16(21-15(2)19)17-13-11-14-18(20)22-17/h16-17H,3-14H2,1-2H3
charge 0 multiplicity 1
54 atoms
O  2.989804 -1.573467 0.396604
O  2.62435 2.054685 -0.315405
O  3.515591 -3.735475 0.860975
O  4.527995 2.912887 0.745549
C  3.130233 -0.323184 -0.426263
C  2.673046 0.806426 0.522784
C  1.285963 0.611261 1.151411
C  4.546637 -0.142886 -0.984842
C  0.126931 0.382357 0.155141
C  -1.248668 0.392747 0.858869
C  4.990741 -1.433758 -1.700141
C  -2.425225 0.071937 -0.089625
C  -3.802338 0.130806 0.608881
C  5.028778 -2.600331 -0.691988
C  -4.980279 -0.240948 -0.319454
C  3.804708 -2.707605 0.218658
C  -6.356929 -0.158182 0.37791
C  -7.536187 -0.552682 -0.539485
C  -8.912031 -0.462945 0.159617
C  3.592628 3.043184 -0.07472
C  -10.085036 -0.862671 -0.761458
C  3.312172 4.261256 -0.927835
H  2.407361 -0.425489 -1.25875
H  3.438142 0.95418 1.308272
H  1.356238 -0.252126 1.839429
H  1.072394 1.504869 1.771157
H  4.535901 0.709632 -1.687436
H  5.250132 0.112697 -0.169062
H  0.260785 -0.593494 -0.353016
H  0.148195 1.165574 -0.6285
H  -1.240094 -0.343372 1.689859
H  -1.413069 1.38685 1.325614
H  4.283982 -1.664946 -2.521517
H  5.986948 -1.304585 -2.159638
H  -2.277809 -0.938565 -0.524817
H  -2.415824 0.782466 -0.942973
H  -3.963224 1.15174 1.014787
H  -3.797502 -0.552889 1.483758
H  5.147465 -3.57951 -1.186909
H  5.900923 -2.486275 -0.016956
H  -4.828234 -1.269316 -0.709199
H  -4.977033 0.42963 -1.204605
H  -6.353748 -0.816295 1.2723
H  -6.515112 0.874496 0.754106
H  -7.539381 0.101214 -1.437059
H  -7.382341 -1.587656 -0.910936
H  -9.065758 0.571807 0.528807
H  -8.906756 -1.114646 1.057342
H  -10.132735 -0.205357 -1.650406
H  -11.055869 -0.792519 -0.236932
H  -9.96932 -1.902793 -1.120845
H  3.07269 3.966967 -1.962815
H  4.181176 4.934858 -0.911295
H  2.433995 4.79834 -0.526351
