program: Gaussian 09
title: 000213712
version: EM64L-G09RevD.01
frameworkgroup: C1[X(C17H12ClN3O5)]
method: RPBEPBE
basis: SDD
operation: Freq
keyword: #p
keyword: freq=noraman
keyword: PBEPBE/SDD
title: #p freq=noraman PBEPBE/SDD
converged: YES YES NO NO
title: Mulliken charges:
elementType: Cl O O O O O N N N C C C C C C C C C C C C C C C C C H H H H H H H H H H H H
charge: 0.065733 -0.435054 -0.374372 -0.215250 -0.180824 -0.164237 -0.467832 0.023792 0.007675 0.160664 -0.198088 0.063155 -0.157322 0.489689 0.058308 -0.306262 0.355872 -0.453546 -0.323948 -0.454628 -0.364024 0.517941 -0.200507 -0.178353 -0.331763 -0.370867 0.253970 0.302673 0.282598 0.238038 0.324463 0.250001 0.277590 0.279354 0.231515 0.373068 0.245163 0.375614
chargesum: 0.00000
title: Mulliken charges with hydrogens summed into heavy atoms:
elementType: Cl O O O O O N N N C C C C C C C C C C C C C C C C C
charge: 0.065733 -0.061986 0.001242 -0.215250 -0.180824 -0.164237 -0.165159 0.023792 0.007675 0.160664 0.055882 0.063155 -0.157322 0.489689 0.058308 -0.023664 0.355872 -0.215508 -0.073947 -0.130165 -0.086434 0.517941 0.078847 0.053162 -0.331763 -0.125704
polarizability: 3.56635689e+02 -9.78882789e+00 2.85768882e+02 -3.03475885e+01 3.86005913e+00 1.21121768e+02
1716.lowfreq: -8.4554 -3.2690 -2.4240 -0.0010 -0.0009 -0.0007 15.3847 20.2474 23.6289
frequency: 15.3283 20.0792 23.5627 42.0014 48.3334 61.0996 84.9905 107.5612 125.8325 133.7389 148.4536 165.7886 190.6719 218.7252 240.8020 257.2613 264.5604 278.4814 286.1017 328.2537 341.5661 345.0233 415.8811 425.6845 429.4233 439.2194 461.6069 472.0916 482.5234 511.6836 521.0048 530.4151 559.1160 570.6458 574.0434 587.5119 644.8473 652.6600 663.2571 675.8989 684.5970 705.6721 711.7509 733.0127 745.7319 762.0625 780.9566 798.5912 809.1546 838.6596 850.5610 861.1877 875.4667 939.8058 945.7430 959.8323 965.7302 971.6237 976.2601 990.0241 1021.9384 1026.4902 1034.5502 1061.7318 1090.5559 1114.4435 1143.5360 1156.1784 1181.4463 1196.5678 1209.5076 1216.2742 1227.5697 1235.2768 1253.7708 1270.6532 1271.8614 1307.3632 1347.7561 1354.9823 1375.5738 1380.7281 1382.5126 1400.7210 1409.1620 1422.5304 1432.8435 1461.4042 1465.1928 1504.9756 1541.6659 1550.1527 1582.6303 1593.1206 1600.8623 1621.0401 3051.7260 3123.5314 3132.4433 3134.7012 3161.8833 3166.0276 3166.4991 3169.7321 3183.9497 3311.5036 3412.4679 3430.2333
redmass: 9.1270 7.6037 7.7353 7.8763 14.8043 8.7175 8.3374 8.5338 8.0245 5.5955 5.4674 5.7086 14.0368 8.2995 5.4237 6.3869 5.5352 9.6578 7.7347 4.4743 7.3403 5.4625 4.4996 3.7930 3.0004 5.1580 3.2950 5.3477 3.0111 3.5406 4.3708 2.0423 4.5550 4.4754 4.3304 4.5111 6.7040 6.6222 3.8967 5.6637 6.1010 3.5346 3.3644 5.3193 5.8112 1.4457 1.3424 4.0741 3.9118 1.4326 1.8798 5.9334 4.0829 1.4382 2.9390 2.2945 1.5993 1.3781 2.1654 1.3887 6.3799 3.2801 2.7140 3.2853 3.8041 2.3634 1.2412 1.5409 1.6133 1.4706 4.6380 1.9531 2.0505 1.8134 2.0272 2.5026 1.6956 1.3832 4.5606 2.0883 2.9369 3.5770 2.9711 1.9451 4.6171 1.4321 2.6464 3.2368 2.8707 4.2136 7.7528 8.0341 8.0674 5.9741 7.2316 6.8182 1.0851 1.0887 1.0908 1.0885 1.0972 1.0891 1.0992 1.0920 1.0975 1.0624 1.0642 1.0738
irintensity: 0.5413 0.0978 1.8415 1.9029 1.0163 2.6361 2.5103 2.2959 1.3274 0.3189 0.5494 4.6501 0.8535 10.0491 2.1468 1.4260 12.1524 4.1000 1.4427 16.1555 14.6559 6.4191 0.9679 1.4162 29.0771 3.5104 14.6343 10.4064 65.1225 13.9592 7.3042 63.7830 1.1422 15.7639 10.4642 3.6698 24.1671 5.7446 53.9814 12.2484 16.6461 24.9980 59.4258 7.8279 1.4724 87.8282 0.6789 37.7454 18.1909 10.5086 60.2464 11.0639 9.9074 1.9599 90.6583 153.6536 19.6527 7.3486 38.1231 1.2960 58.1403 44.6604 30.2468 58.2918 74.9810 13.2669 1.0624 1.6789 8.7010 25.1056 318.6507 6.6742 13.5367 182.3358 6.1286 24.1388 65.2380 6.8960 25.9405 92.9950 95.8503 46.2380 49.0346 4.3334 21.2413 36.1731 47.1466 47.6133 53.0092 19.3313 16.8990 65.9891 148.1932 2.9910 82.0493 5.8737 21.2490 15.0160 6.1683 13.5859 3.7268 1.0787 34.8516 10.8579 0.6391 147.2462 52.4923 11.2716
temp: 298.150 k
press: 1.00000 atm
elementType: 17 8 8 8 8 8 7 7 7 6 6 6 6 6 6 6 6 6 6 6 6 6 6 6 6 6 1 1 1 1 1 1 1 1 1 1 1 1
symmnumber: 1
zpe: 694697.9 jmol-1
zpe.correction: 0.264596 hartree
zpe.thermalcorrener: 0.286903 hartree
zpe.thermalcorrenthalpy: 0.287847 hartree
zpe.thermalcorrgfe: 0.209706 hartree
zpe.sumelectzpe: -1653.509898 hartree
zpe.sumelectthermal: -1653.487591 hartree
zpe.sumelectthermalent: -1653.486647 hartree
zpe.sumelectthermalfe: -1653.564789 hartree
dipole: 5.3417 0.4524 -2.0558
dipole: 5.7415
quadrupole: -168.3133 -159.3062 -158.0833
quadrupole: 1.7298 -1.6873 5.4111
quadrupole: -6.4124 2.5947 3.8177 1.7298 -1.6873 5.4111
hfenergy: -1653.7744941 hartree
pointgroup: C01 [X(C17H12Cl1N3O5)]
dipole: 2.0610189 -0.3684547 0.8478974 debye
polarizability: 356.10799|2.9716797|284.4180939|36.3659647|6.6521405|123.0002551 unknown
InChI: InChI=1S/C17H12ClN3O5/c18-11-5-3-10(8-13(11)21(25)26)15(22)17(24)20-12-6-4-9-2-1-7-19-14(9)16(12)23/h1-8,17,20,23-24H
charge 0 multiplicity 1
38 atoms
Cl -4.420728 3.419644 0.613304
O  0.158057 -3.60831 0.650941
O  1.385329 1.052536 -1.025898
O  -2.253558 -3.028214 -0.316208
O  -6.097103 -0.130988 -1.366336
O  -6.575866 1.402768 0.256604
N  0.671839 -1.527779 -0.556679
N  3.936933 2.064867 -0.414986
N  -5.762108 0.65366 -0.398013
C  2.026542 -1.129034 -0.202729
C  -0.129314 -2.192176 0.487443
C  2.345377 0.220888 -0.467423
C  3.650825 0.736181 -0.1451
C  4.608213 -0.172785 0.459998
C  -1.629594 -2.015039 0.120809
C  2.978011 -2.005002 0.400781
C  -2.28684 -0.684198 0.25664
C  4.24976 -1.533955 0.729342
C  5.903317 0.359884 0.769243
C  -3.643876 -0.572576 -0.13075
C  -1.618688 0.464459 0.764136
C  -4.32658 0.649371 0.001825
C  -2.295755 1.692546 0.870055
C  6.187372 1.697337 0.490343
C  -3.654386 1.79711 0.497157
C  5.167924 2.512196 -0.10073
H  0.108754 -1.705578 1.448756
H  0.597906 -2.012676 -1.462677
H  2.680522 -3.04033 0.597687
H  4.987114 -2.200716 1.190043
H  -4.167532 -1.444225 -0.535523
H  6.65611 -0.294359 1.223919
H  -0.570295 0.417949 1.070513
H  -1.772983 2.581594 1.232564
H  7.166754 2.13138 0.714276
H  -0.578236 -4.114877 0.200759
H  5.367719 3.566941 -0.325149
H  0.571965 0.471508 -1.140538
