program: Gaussian 09
title: 000205937
version: EM64L-G09RevD.01
frameworkgroup: C1[X(C23H23NOS)]
method: RPBEPBE
basis: SDD
operation: Freq
keyword: #p
keyword: freq=noraman
keyword: PBEPBE/SDD
title: #p freq=noraman PBEPBE/SDD
converged: YES YES NO NO
title: Mulliken charges:
elementType: S O N C C C C C C C C C C C C C C C C C C C C C C C H H H H H H H H H H H H H H H H H H H H H H H
charge: 0.148881 -0.288193 -0.412411 0.026317 -0.632435 -0.735468 0.535564 0.147631 -0.397864 -0.448729 -0.837284 0.257101 0.492797 -0.230340 -0.233308 -0.244200 -0.372044 -0.343796 -0.432054 -0.353243 -0.217549 -0.234586 -0.223631 -0.249039 -0.257834 -0.230216 0.259345 0.251311 0.222184 0.256447 0.308450 0.340440 0.231108 0.247281 0.278176 0.266394 0.225732 0.225470 0.228622 0.274377 0.243286 0.260221 0.253597 0.236524 0.230785 0.231531 0.230719 0.232496 0.231440
chargesum: 0.00000
title: Mulliken charges with hydrogens summed into heavy atoms:
elementType: S O N C C C C C C C C C C C C C C C C C C C C C C C
charge: 0.148881 -0.288193 -0.071972 0.285662 -0.158939 -0.170571 0.535564 0.147631 -0.166757 -0.201449 -0.292714 0.257101 0.492797 -0.004608 -0.007838 -0.015578 -0.097667 -0.100510 -0.171834 -0.099646 0.018975 -0.003801 0.007900 -0.018320 -0.025338 0.001224
polarizability: 2.67067733e+02 6.60788939e+00 2.24858792e+02 1.39027686e+01 2.12323419e+01 2.79192837e+02
1716.lowfreq: -11.3878 -2.7262 -0.0019 -0.0013 0.0009 7.5256 14.2195 19.8871 21.9244
frequency: 14.1486 19.5547 21.9090 32.1315 35.0639 39.2520 51.8880 59.1943 70.6696 89.0092 112.2222 119.6894 153.0335 170.9323 200.0718 220.5775 225.5646 273.8815 290.4371 318.6629 337.1642 359.0549 390.9084 404.6891 405.0947 406.1038 423.5973 455.7776 483.4336 500.3089 505.9961 535.9712 554.8797 605.7096 613.0137 614.6001 617.0751 640.5747 660.8283 670.0274 691.5998 706.4781 707.2711 708.3895 752.7217 757.4357 792.5746 797.9072 813.0677 835.6340 840.3250 856.8348 858.2790 863.3435 866.4910 891.5236 926.0522 934.4848 941.1095 962.9241 979.0031 983.5717 986.9042 988.7815 989.7366 989.9548 995.6055 999.4649 1003.9701 1024.4520 1026.0877 1026.6348 1053.6739 1059.9028 1080.5710 1082.3190 1096.6491 1129.3113 1162.5727 1172.0073 1172.6059 1172.8459 1183.1814 1189.1557 1190.4836 1190.8871 1200.4832 1213.5620 1216.9311 1237.8373 1257.8471 1276.7413 1299.5608 1316.4777 1318.7741 1326.4924 1339.0773 1358.4287 1378.8438 1381.6244 1383.0844 1424.4980 1431.0854 1432.0763 1439.8775 1440.4052 1460.9521 1474.6135 1480.7464 1484.4695 1493.8221 1564.3013 1588.0164 1592.0581 1599.0814 1608.7094 1610.6709 1614.1909 2980.5824 2994.3283 3013.4890 3022.0244 3052.9355 3085.5672 3098.3397 3109.1035 3114.0385 3122.0364 3122.6187 3125.7374 3129.9199 3131.4426 3137.2381 3142.2034 3143.5740 3147.5319 3155.9317 3161.5783 3163.7074 3167.7057 3530.2937
redmass: 5.8412 4.7325 5.3284 4.5280 3.9827 5.2943 4.8081 4.3000 5.1209 4.6746 4.9219 4.4720 6.6500 5.4552 5.1441 5.0404 3.5371 2.5247 3.7956 4.3458 2.4070 4.2045 3.5225 2.8371 2.8502 2.8695 4.1089 3.2512 3.7556 1.4792 2.5750 3.7523 5.0884 4.5306 6.2267 6.3775 6.2689 4.5944 5.8651 5.5974 4.6578 1.9326 1.8708 1.5752 1.7559 1.6259 2.3763 4.5834 3.0578 2.2980 3.5198 1.2693 1.2746 1.3985 1.6989 1.8322 1.4909 1.5218 1.4455 2.5961 1.3907 1.3957 1.5985 5.9201 5.8296 3.7365 1.3164 1.3049 1.3409 2.4257 2.2222 2.2236 1.9443 2.0987 1.6286 1.5796 1.7857 1.9937 1.1630 1.0626 1.0583 1.0568 1.6354 1.1273 1.1547 1.1293 1.2900 1.9777 2.3577 1.3786 1.3169 1.8906 1.3964 1.4526 1.3755 1.2720 1.3313 1.2900 7.8801 7.2584 8.8181 1.2203 1.4700 1.6094 2.0723 1.6674 1.5311 1.4273 2.2448 2.2605 2.1300 6.2498 5.9964 5.9927 6.4773 6.0111 6.0184 6.0935 1.0821 1.0611 1.0594 1.0607 1.1002 1.1040 1.1043 1.0882 1.0873 1.0848 1.0857 1.0876 1.0901 1.0881 1.0918 1.0954 1.0927 1.0962 1.0958 1.1013 1.1015 1.1007 1.0781
irintensity: 0.1275 2.2404 0.0687 1.4172 0.2896 0.9668 4.0387 0.6838 3.5790 0.8441 0.9641 3.6919 1.8025 1.1968 0.8823 6.5680 6.4519 4.1077 0.4902 0.5524 0.8199 1.4220 5.9201 0.4412 0.0798 0.3319 2.2797 9.9039 5.0400 135.8488 50.7744 5.3338 5.1480 2.7109 0.6476 0.1355 0.4541 7.6138 9.0920 17.9263 2.1439 73.1917 52.1813 76.7196 49.6992 46.4455 18.9093 1.9749 3.1128 9.8778 5.7749 0.6085 3.1605 1.4334 0.5490 5.1061 5.0951 7.6543 1.7657 12.7493 0.1713 0.1731 1.3874 0.2451 0.1339 0.2768 0.2207 0.8204 1.1753 4.2693 2.8373 7.8044 3.5299 2.0429 12.1508 20.2256 7.9007 4.8721 4.3282 0.2656 0.5300 0.5121 10.4511 1.6471 3.1064 0.5397 7.6312 0.6159 0.8000 8.8222 5.8231 98.9778 14.5628 4.7322 5.6611 1.3109 4.7585 11.2528 0.5076 0.5912 1.2888 4.9613 9.9073 13.4703 6.5587 15.5076 183.9780 16.9301 14.4132 19.5036 135.3407 114.4805 1.2772 0.9856 42.8719 3.2672 5.3315 6.6220 9.1122 17.1611 15.8402 15.1530 10.7089 7.0292 4.7607 5.1319 7.4882 2.2372 2.6424 0.0816 6.5606 3.7731 11.6838 33.4169 25.8103 29.9737 14.2328 24.3270 17.5474 21.4465 44.7818
temp: 298.150 k
press: 1.00000 atm
elementType: 16 8 7 6 6 6 6 6 6 6 6 6 6 6 6 6 6 6 6 6 6 6 6 6 6 6 1 1 1 1 1 1 1 1 1 1 1 1 1 1 1 1 1 1 1 1 1 1 1
symmnumber: 1
zpe: 1042155.2 jmol-1
zpe.correction: 0.396936 hartree
zpe.thermalcorrener: 0.420890 hartree
zpe.thermalcorrenthalpy: 0.421835 hartree
zpe.thermalcorrgfe: 0.338671 hartree
zpe.sumelectzpe: -1416.456625 hartree
zpe.sumelectthermal: -1416.432670 hartree
zpe.sumelectthermalent: -1416.431726 hartree
zpe.sumelectthermalfe: -1416.514889 hartree
dipole: 0.2740 0.3144 3.7423
dipole: 3.7655
quadrupole: -153.0188 -160.4136 -158.5328
quadrupole: -4.5100 7.4750 2.8203
quadrupole: 4.3030 -3.0919 -1.2111 -4.5100 7.4750 2.8203
hfenergy: -1416.8535608 hartree
pointgroup: C01 [X(C23H23N1O1S1)]
dipole: -0.373262 -0.2579029 1.4102698 debye
polarizability: 218.9638165|-8.3195622|267.8414352|0.180928|-16.6376267|284.3141103 unknown
InChI: InChI=1S/C23H23NOS/c25-23(21-14-8-3-9-15-21)24-22(16-19-10-4-1-5-11-19)18-26-17-20-12-6-2-7-13-20/h1-15,22,24H,16-18H2
charge 0 multiplicity 1
49 atoms
S  -2.348987 1.98818 -2.610584
O  1.418832 -0.96372 -2.866518
N  0.360572 0.146156 -1.12423
C  0.448511 1.459078 -1.791729
C  0.302019 2.605426 -0.757122
C  -0.535522 1.580752 -2.984278
C  1.298669 2.518909 0.390543
C  0.918069 -0.984892 -1.692399
C  2.678304 2.777332 0.1808
C  0.868944 2.15973 1.694346
C  -3.023886 0.37744 -1.846007
C  0.897907 -2.242948 -0.861726
C  -2.973185 0.306694 -0.329937
C  3.60437 2.6751 1.241874
C  1.793075 2.055187 2.760181
C  3.165152 2.311199 2.536961
C  0.948279 -3.484184 -1.546197
C  0.876228 -2.231579 0.5579
C  -2.541356 -0.881808 0.314475
C  -3.396761 1.398666 0.473125
C  -2.533131 -0.979054 1.726663
C  -3.391921 1.303381 1.881955
C  0.945527 -4.697045 -0.826423
C  0.882937 -3.447077 1.277814
C  -2.958427 0.113378 2.515821
C  0.908554 -4.68198 0.588665
H  1.459062 1.500251 -2.248691
H  -0.734179 2.602383 -0.370777
H  0.424596 3.556786 -1.309941
H  -0.231912 2.426757 -3.627704
H  -0.497671 0.659816 -3.588401
H  -0.130678 0.083651 -0.22989
H  3.029372 3.062217 -0.819319
H  -0.197659 1.97299 1.878163
H  -4.069295 0.354087 -2.202876
H  -2.486626 -0.464809 -2.312719
H  4.665888 2.879579 1.061654
H  1.441895 1.781048 3.761731
H  3.88324 2.232873 3.360943
H  1.001495 -3.46924 -2.63982
H  0.895683 -1.283391 1.108358
H  -2.218144 -1.739646 -0.287648
H  -3.715385 2.327546 -0.01434
H  -2.192988 -1.906346 2.201553
H  -3.726578 2.15466 2.48574
H  0.978234 -5.651248 -1.363706
H  0.883542 -3.430314 2.373423
H  -2.955975 0.039484 3.60903
H  0.91321 -5.623654 1.149063
