program: Gaussian 09
title: 000205915
version: EM64L-G09RevD.01
frameworkgroup: C1[X(C18H17N3O3)]
method: RPBEPBE
basis: SDD
operation: Freq
keyword: #p
keyword: freq=noraman
keyword: PBEPBE/SDD
title: #p freq=noraman PBEPBE/SDD
converged: YES YES NO NO
title: Mulliken charges:
elementType: O O O N N N C C C C C C C C C C C C C C C C C C H H H H H H H H H H H H H H H H H
charge: -0.226702 -0.212221 -0.206879 -0.049244 -0.212789 0.013776 -0.373127 -0.423968 0.253590 -0.544566 0.392881 0.246807 -0.475304 0.240013 0.118917 -0.375207 -0.523694 -0.385637 -0.314889 0.385655 -0.252870 -0.242835 -0.641466 -0.417225 0.281536 0.230533 0.216080 0.242536 0.217458 0.214244 0.267223 0.242326 0.317241 0.235877 0.253844 0.231235 0.229815 0.284339 0.237294 0.234558 0.290846
chargesum: 0.00000
title: Mulliken charges with hydrogens summed into heavy atoms:
elementType: O O O N N N C C C C C C C C C C C C C C C C C C
charge: -0.226702 -0.212221 -0.206879 -0.049244 -0.212789 0.013776 -0.091591 0.022644 0.253590 -0.084572 0.392881 0.246807 0.006163 0.240013 0.118917 -0.132882 -0.206453 -0.149760 -0.061045 0.385655 -0.021635 -0.013020 0.114725 -0.126379
polarizability: 2.63286158e+02 -1.82339053e+01 2.72136282e+02 1.33614043e+01 7.13790018e+00 1.67044329e+02
1716.lowfreq: -6.1685 -3.1151 0.0001 0.0003 0.0005 4.3126 40.5122 47.4705 50.7781
frequency: 40.4912 47.4645 50.7689 62.4849 95.1158 95.7747 117.0716 130.6482 144.5050 179.6763 195.5079 224.0787 229.8962 253.5592 272.4962 303.5693 328.3563 334.1088 367.0781 378.1666 400.1657 430.9074 446.1193 451.6135 475.0153 494.6432 508.1913 524.7856 540.0997 562.3655 575.2890 622.0696 627.7025 655.1136 682.7262 701.5718 718.9606 734.2105 745.0763 754.4440 764.5555 792.4161 815.8452 843.7791 871.1018 881.8338 890.3496 914.4842 931.0357 952.2920 959.7115 968.4106 982.7498 989.4542 1003.0020 1036.9043 1050.4003 1055.7066 1086.4126 1096.1483 1113.1150 1124.1986 1131.2843 1134.8894 1138.6979 1163.9973 1175.8933 1200.3731 1203.8668 1210.6441 1215.6357 1226.6204 1253.7029 1257.0707 1275.2960 1276.6186 1309.7517 1320.5083 1324.9045 1343.2737 1356.3316 1360.1325 1384.2120 1385.8024 1398.4819 1421.1434 1429.1412 1441.7279 1445.1987 1464.0196 1465.3486 1475.7371 1480.6791 1491.2082 1497.9962 1581.5015 1593.8933 1595.7630 1615.7319 1616.3784 2853.5772 2872.3605 2970.2386 2982.9965 2988.3863 3035.0244 3040.1652 3066.4528 3082.9952 3115.3046 3120.3441 3126.3436 3141.3504 3159.3130 3162.9347 3170.6331 3186.7187
redmass: 4.7582 6.6710 7.9788 7.8549 4.6135 3.6888 4.2400 1.1864 3.3015 4.4947 5.0434 2.9952 3.7719 5.2253 3.9106 4.9734 3.6669 4.1860 4.3050 5.1075 4.3597 3.4725 4.0684 3.2739 5.0348 5.7891 4.0890 4.3073 4.9057 4.8196 4.4312 5.3539 3.9765 5.4193 4.7764 6.7348 5.0705 4.5255 2.0337 3.2918 3.7837 2.9417 2.4880 1.5380 1.6887 3.0815 3.1130 2.9527 3.1124 1.4253 1.5758 2.4058 1.3440 1.3278 2.1060 2.5458 3.0737 2.2489 2.2820 2.4644 1.5279 1.8144 2.6155 2.9049 1.6682 1.9910 1.0646 1.2066 1.8130 6.6741 1.6972 1.8112 1.6243 1.5775 1.5228 1.8129 1.6703 2.2543 1.5156 1.5348 1.6224 9.3188 2.7690 2.1165 5.8638 1.5294 2.3671 2.2878 1.1458 1.1234 1.0856 2.2064 1.1782 2.5216 1.0695 8.3513 7.3734 7.2163 7.0174 7.1616 1.0708 1.0707 1.0824 1.0608 1.0380 1.0902 1.0992 1.0885 1.0958 1.0873 1.0890 1.1022 1.0928 1.0893 1.1004 1.0916 1.0959
irintensity: 0.6334 1.8481 0.1970 3.6998 3.2925 0.8650 1.8874 0.8752 0.0225 0.6430 2.7281 0.5609 4.2873 3.0989 4.2232 1.7376 10.5057 0.4873 0.1814 4.6812 1.5409 3.5193 4.7116 3.7682 7.1379 0.3144 2.7958 16.6199 4.1200 3.6418 1.4806 2.7360 25.7814 0.6868 2.9954 13.6612 3.2629 51.9190 24.3514 9.4903 11.4121 17.1147 7.6382 31.5747 0.6719 9.3021 0.7370 19.7319 8.5819 2.6164 6.3071 29.0090 3.4019 0.1006 2.3549 4.9098 35.0822 5.2943 17.8146 29.0337 40.8351 39.5262 56.7657 11.9476 6.6552 13.4875 0.8233 10.0404 6.8282 500.9114 16.4296 6.4299 1.7511 37.9777 2.7407 43.6667 42.3019 62.6592 32.9757 1.5521 14.4371 118.5332 2.1826 6.9772 3.3524 12.3180 61.4093 2.3701 14.7393 39.5802 4.6198 46.6988 12.1986 16.8320 32.5030 8.4888 159.6081 247.9103 45.0733 19.3964 48.0666 75.8495 9.2638 24.9377 39.2500 36.4827 21.0167 13.9559 18.4829 12.2828 3.5073 1.1967 23.3898 6.5286 28.6480 3.1477 2.8029
temp: 298.150 k
press: 1.00000 atm
elementType: 8 8 8 7 7 7 6 6 6 6 6 6 6 6 6 6 6 6 6 6 6 6 6 6 1 1 1 1 1 1 1 1 1 1 1 1 1 1 1 1 1
symmnumber: 1
zpe: 839565.5 jmol-1
zpe.correction: 0.319774 hartree
zpe.thermalcorrener: 0.339481 hartree
zpe.thermalcorrenthalpy: 0.340425 hartree
zpe.thermalcorrgfe: 0.271544 hartree
zpe.sumelectzpe: -1084.257395 hartree
zpe.sumelectthermal: -1084.237688 hartree
zpe.sumelectthermalent: -1084.236744 hartree
zpe.sumelectthermalfe: -1084.305625 hartree
dipole: 0.9790 -1.9509 0.6483
dipole: 2.2770
quadrupole: -121.1313 -184.9958 -128.5214
quadrupole: 6.3916 5.2605 9.3299
quadrupole: 23.7515 -40.1129 16.3615 6.3916 5.2605 9.3299
hfenergy: -1084.5771687 hartree
pointgroup: C01 [X(C18H17N3O3)]
dipole: 0.20576 0.8289709 -0.2702212 debye
polarizability: 255.3956745|14.5533636|279.4671604|-16.5993773|2.3309259|167.603934 unknown
InChI: InChI=1S/C18H17N3O3/c1-19-16-7-6-13(21(23)24)10-15(16)18-14-5-3-2-4-12(14)8-9-20(18)11-17(19)22/h2-7,10,18H,8-9,11H2,1H3
charge 0 multiplicity 1
41 atoms
O  1.674395 4.186425 -0.169534
O  2.49872 -4.348936 0.533707
O  0.270436 -3.998798 0.884952
N  -0.655764 1.912146 0.943119
N  2.142569 1.949083 -0.63782
N  1.453953 -3.586515 0.568147
C  -0.565755 1.004619 -0.24267
C  -1.308173 1.278956 2.116474
C  -1.890472 0.291865 -0.506157
C  -2.780472 0.989686 1.785743
C  0.636389 0.044767 -0.132905
C  -2.93234 0.265003 0.456829
C  0.656656 2.508992 1.306096
C  1.95361 0.560808 -0.365828
C  1.488386 2.967373 0.101463
C  -2.073909 -0.357453 -1.753293
C  0.492324 -1.32012 0.184944
C  -4.136255 -0.419363 0.148452
C  3.075058 -0.313693 -0.365446
C  1.626151 -2.158657 0.227292
C  -3.274251 -1.032151 -2.052481
C  -4.313467 -1.065018 -1.092097
C  3.154012 2.370425 -1.635639
C  2.9202 -1.67585 -0.067235
H  -0.364466 1.662956 -1.112128
H  -1.244196 1.987471 2.962299
H  -0.785653 0.341091 2.430185
H  -3.324197 1.953232 1.734657
H  -3.241325 0.398753 2.600239
H  1.284082 1.80019 1.903847
H  0.474816 3.407661 1.918317
H  -1.264817 -0.333839 -2.494009
H  -0.497305 -1.752094 0.357736
H  -4.940071 -0.442804 0.89479
H  4.073445 0.083018 -0.571489
H  -3.400499 -1.527441 -3.02116
H  -5.249644 -1.590557 -1.310202
H  2.892381 3.38672 -1.968006
H  3.147159 1.676458 -2.491121
H  4.168958 2.407623 -1.197302
H  3.770428 -2.36203 -0.042768
