program: Gaussian 09
title: 000213694
version: EM64L-G09RevD.01
frameworkgroup: C1[X(C23H16N2O3)]
method: RPBEPBE
basis: SDD
operation: Freq
keyword: #p
keyword: freq=noraman
keyword: PBEPBE/SDD
title: #p freq=noraman PBEPBE/SDD
converged: YES YES NO NO
title: Mulliken charges:
elementType: O O O N N C C C C C C C C C C C C C C C C C C C C C C C H H H H H H H H H H H H H H H H
charge: -0.298341 -0.367349 -0.234290 0.028214 -0.054717 0.278667 -0.183513 0.162391 0.216054 -0.334403 -0.301749 -0.398372 0.280577 0.327132 -0.178648 -0.315052 -0.330207 0.077227 -0.374475 -0.392702 -0.367037 -0.354931 0.347318 -0.360861 -0.381580 -0.203126 -0.192591 -0.246966 0.250335 0.279715 0.226958 0.231792 0.290328 0.280787 0.268642 0.260685 0.245980 0.234710 0.267313 0.259626 0.360506 0.230675 0.232597 0.232682
chargesum: 0.00000
title: Mulliken charges with hydrogens summed into heavy atoms:
elementType: O O O N N C C C C C C C C C C C C C C C C C C C C C C C
charge: -0.298341 -0.006843 -0.234290 0.028214 -0.054717 0.278667 -0.183513 0.162391 0.216054 -0.084068 -0.022034 -0.171414 0.280577 0.327132 0.053144 -0.024724 -0.049420 0.077227 -0.105833 -0.132018 -0.121057 -0.120220 0.347318 -0.093548 -0.121954 0.027549 0.040006 -0.014284
polarizability: 4.68547261e+02 3.32641887e+00 3.67370134e+02 -1.10084107e+01 7.76718127e+00 1.51134235e+02
1716.lowfreq: -0.0001 0.0004 0.0008 1.1099 2.2800 5.6946 14.5658 18.4805 26.1785
frequency: 14.5140 18.4524 26.1022 32.1898 48.5692 63.4999 76.6678 106.4646 118.0459 121.5109 160.9133 167.1132 180.8869 219.4012 229.6245 250.5569 277.0152 289.9670 317.9286 355.8383 375.3931 408.5650 410.1171 413.3995 416.1360 431.4810 450.0195 467.4813 474.3613 485.1073 496.8234 540.4236 545.1599 572.9768 588.4038 607.8308 613.1859 621.5615 641.6916 650.3841 671.4742 685.9545 693.5481 707.4625 752.0708 756.0673 765.5994 780.6432 807.6366 816.5600 822.5095 833.5065 836.5312 845.4468 853.9565 864.4878 911.8002 924.5687 949.8366 969.2389 970.0496 987.1978 989.1366 992.6160 997.5174 998.6318 1003.1623 1005.6892 1019.3403 1029.2680 1041.4392 1068.8364 1076.9061 1113.5634 1136.2258 1152.6767 1170.0672 1170.6467 1172.7211 1185.5767 1195.0385 1220.8311 1223.0734 1234.2714 1277.0143 1296.2471 1298.2015 1308.1896 1324.8776 1337.6696 1369.0594 1380.7823 1384.9305 1390.1787 1411.7621 1425.9550 1442.1529 1465.9876 1470.4067 1487.4930 1502.8518 1512.7921 1542.6750 1569.3677 1573.1464 1585.0862 1595.3734 1601.2462 1604.1753 1616.7285 2984.5478 3119.2178 3125.9898 3133.1556 3142.5337 3152.1518 3152.9909 3153.8465 3155.4263 3157.4908 3166.3058 3172.8783 3175.2835 3176.3981 3176.8397 3556.9871
redmass: 5.2763 6.4729 4.4545 5.8320 5.8230 5.7761 4.7967 7.5641 5.6312 5.0651 3.8257 5.3367 6.1984 5.0400 5.5479 6.1381 5.7143 6.2402 7.1111 5.8806 5.1744 2.9404 2.4647 2.5006 2.9414 2.2285 7.0978 3.3374 6.7968 4.0612 3.3035 5.7946 7.2287 5.1710 5.6667 6.5593 3.9994 5.2971 6.3766 3.9367 5.6970 4.0909 2.5503 4.1543 3.9239 3.1432 3.1766 3.4959 1.6048 2.0484 3.9394 1.2934 2.8034 1.3001 3.8031 1.7474 1.4166 1.3940 1.4253 1.4238 1.5483 5.6444 1.3444 1.3439 3.7672 1.4757 2.2700 1.5736 2.1047 3.6071 2.4111 3.3534 1.5051 1.3062 1.3134 2.0991 1.2413 1.2141 1.1844 1.4459 1.7360 2.5532 3.3615 2.1704 2.3300 1.6684 2.5146 1.3308 1.8885 2.8409 5.3113 2.2621 8.8677 2.3144 3.9703 4.4060 2.2865 2.8443 2.2826 2.6455 4.4165 7.2522 6.6461 6.1085 7.2629 7.0530 6.2594 6.6814 7.2603 6.4878 1.0866 1.0891 1.0895 1.0851 1.0891 1.0941 1.0884 1.0905 1.0901 1.0923 1.0968 1.0961 1.0988 1.0998 1.0974 1.0658
irintensity: 0.9462 0.4545 0.0571 0.9286 0.6733 0.6980 2.0852 1.3672 2.5220 0.0696 16.3311 7.4859 5.8542 13.9142 0.5843 5.5662 0.6126 17.6757 1.1580 11.7772 6.3986 15.3957 20.5605 47.6984 5.5658 36.6123 0.7878 6.7229 6.0800 28.3362 14.9907 41.5554 2.3808 3.6883 0.6703 1.6851 6.8180 9.0323 13.6513 5.7025 9.6078 5.9634 30.1270 11.4895 12.6467 47.9371 12.6386 54.6994 96.2456 6.2675 21.8799 6.9660 3.2482 10.4439 55.7920 66.0491 7.0027 1.8293 0.1498 6.6073 12.5129 3.4376 2.2373 1.2573 17.6520 9.7102 0.8036 3.9148 15.2415 188.1620 26.2815 26.7208 12.2039 15.4636 12.2261 13.6901 160.9159 22.6314 153.3856 124.5979 60.2541 20.7726 470.6421 97.5600 261.6703 97.5735 177.6378 1.4501 111.7728 26.2902 9.9570 38.3125 5.2899 31.8219 38.7779 48.2240 5.3049 74.5728 154.0858 78.0323 54.2016 181.8977 384.9153 15.5295 40.8855 2.7462 89.8906 158.6532 1.0839 77.7887 61.2788 23.7516 20.6185 1.9485 9.0895 5.1294 0.3118 14.4092 9.3680 18.9927 13.3203 2.9963 14.6604 3.7904 22.8684 102.3765
temp: 298.150 k
press: 1.00000 atm
elementType: 8 8 8 7 7 6 6 6 6 6 6 6 6 6 6 6 6 6 6 6 6 6 6 6 6 6 6 6 1 1 1 1 1 1 1 1 1 1 1 1 1 1 1 1
symmnumber: 1
zpe: 862301.4 jmol-1
zpe.correction: 0.328433 hartree
zpe.thermalcorrener: 0.351259 hartree
zpe.thermalcorrenthalpy: 0.352203 hartree
zpe.thermalcorrgfe: 0.272883 hartree
zpe.sumelectzpe: -1219.280816 hartree
zpe.sumelectthermal: -1219.257990 hartree
zpe.sumelectthermalent: -1219.257046 hartree
zpe.sumelectthermalfe: -1219.336367 hartree
dipole: -0.1534 -2.4685 1.1950
dipole: 2.7468
quadrupole: -137.9475 -168.3069 -158.6023
quadrupole: -26.1786 -6.8290 8.1307
quadrupole: 17.0048 -13.3547 -3.6501 -26.1786 -6.8290 8.1307
hfenergy: -1219.6092497 hartree
pointgroup: C01 [X(C23H16N2O3)]
dipole: 0.056724 1.0001995 -0.4052793 debye
polarizability: 460.6617741|36.8785784|241.6990011|34.7195244|-102.2657246|284.6908555 unknown
InChI: InChI=1S/C23H16N2O3/c26-21-13-12-20(19-7-4-14-24-23(19)21)25-15-22(27)16-8-10-18(11-9-16)28-17-5-2-1-3-6-17/h1-15,26H
charge 0 multiplicity 1
44 atoms
O  -4.911223 -0.615974 0.260301
O  6.789722 1.885598 0.631138
O  0.184108 -3.346561 3.021848
N  4.993011 1.909641 -1.43919
N  1.760784 -0.663664 1.253196
C  3.356657 0.604003 -0.095911
C  4.634904 1.259501 -0.270784
C  3.045312 -0.082634 1.140308
C  5.576773 1.235696 0.825656
C  3.997058 -0.068131 2.180398
C  2.440324 0.651692 -1.194553
C  5.242352 0.589347 2.028926
C  -1.100519 -1.799224 1.689953
C  -3.611899 -0.972938 0.670506
C  2.805446 1.314936 -2.367772
C  -1.226072 -0.573655 0.976004
C  -2.268939 -2.592813 1.891585
C  0.175006 -2.306203 2.275255
C  -2.471664 -0.157577 0.468001
C  -3.513685 -2.190566 1.388724
C  4.096338 1.926819 -2.444449
C  1.516815 -1.674099 2.051721
C  -5.125521 0.294816 -0.812042
C  -4.43284 0.183263 -2.039536
C  -6.152006 1.245273 -0.631641
C  -4.772052 1.057352 -3.095896
C  -6.482967 2.109769 -1.698869
C  -5.793242 2.022986 -2.930987
H  3.760294 -0.534828 3.142389
H  1.469175 0.161026 -1.08424
H  5.950866 0.598962 2.867104
H  2.124907 1.372108 -3.222931
H  -0.339899 0.04904 0.833001
H  -2.164381 -3.527657 2.451627
H  -2.560117 0.795037 -0.062518
H  -4.4156 -2.791686 1.535606
H  4.40842 2.448506 -3.357136
H  2.306893 -2.204761 2.621726
H  -3.657847 -0.578743 -2.169904
H  -6.673769 1.291098 0.328809
H  7.364051 1.803394 1.434853
H  -4.24359 0.974408 -4.051935
H  -7.278878 2.850422 -1.565619
H  -6.052605 2.695223 -3.755523
